program: Orca
programVersion: 5.0.2
elementType: N H C H C O C C O N H C H H H O H H S H C O C H H C H H C H N H H C O O H H
charge: 1
multiplicity: 1
keywords: wB97X-D3BJ Opt Freq def2-TZVPP def2/J RIJCOSX VeryTightSCF
keywords: PAL8 defgrid3 TightOpt
frequency: 0.00 0.00 0.00 0.00 0.00 0.00 32.14 37.24 51.78 59.91 60.32 70.28 78.92 89.68 103.40 124.56 141.55 177.30 187.02 207.74 230.87 246.52 259.18 286.62 294.75 305.98 319.06 351.66 361.59 419.38 423.36 489.33 491.84 514.75 547.15 562.31 576.15 595.22 615.61 647.99 674.85 680.59 719.93 726.50 751.02 777.52 788.01 796.93 798.42 812.42 854.37 879.58 903.51 915.63 963.15 982.35 997.17 1036.27 1063.64 1097.37 1116.08 1147.31 1158.70 1180.35 1189.28 1211.62 1230.07 1246.84 1264.78 1273.15 1275.85 1300.78 1351.74 1355.12 1356.74 1365.35 1378.53 1395.35 1404.98 1425.09 1442.54 1466.90 1476.72 1488.66 1494.53 1497.64 1512.56 1527.14 1533.49 1546.00 1602.41 1699.59 1721.55 1785.79 1814.27 1839.19 2475.11 2753.46 3092.22 3103.64 3107.88 3117.69 3118.62 3143.68 3160.80 3162.64 3181.78 3220.63 3490.99 3496.91 3574.55 3609.99 3622.82 3731.10
frequency: 32.14 37.24 51.78 59.91 60.32 70.28 78.92 89.68 103.40 124.56 141.55 177.30 187.02 207.74 230.87 246.52 259.18 286.62 294.75 305.98 319.06 351.66 361.59 419.38 423.36 489.33 491.84 514.75 547.15 562.31 576.15 595.22 615.61 647.99 674.85 680.59 719.93 726.50 751.02 777.52 788.01 796.93 798.42 812.42 854.37 879.58 903.51 915.63 963.15 982.35 997.17 1036.27 1063.64 1097.37 1116.08 1147.31 1158.70 1180.35 1189.28 1211.62 1230.07 1246.84 1264.78 1273.15 1275.85 1300.78 1351.74 1355.12 1356.74 1365.35 1378.53 1395.35 1404.98 1425.09 1442.54 1466.90 1476.72 1488.66 1494.53 1497.64 1512.56 1527.14 1533.49 1546.00 1602.41 1699.59 1721.55 1785.79 1814.27 1839.19 2475.11 2753.46 3092.22 3103.64 3107.88 3117.69 3118.62 3143.68 3160.80 3162.64 3181.78 3220.63 3490.99 3496.91 3574.55 3609.99 3622.82 3731.10
formula: C10H18N3O6S
InChI: InChI=1S/C10H18N3O6S/c11-5(10(18)19)1-2-7(14)13-6(4-20)9(17)12-3-8(15)16/h5-6,12-13,15,18,20H,1-4H2,11H3
38 atoms
N  -1.577319 -1.28372 -2.419939
H  -1.491497 -1.82911 -3.265796
C  -1.951197 0.102584 -2.605841
H  -2.816455 0.154077 -3.268743
C  -0.806026 0.85804 -3.264789
O  -0.295534 0.490579 -4.29803
C  -0.910441 -1.845395 -1.371228
C  -0.880996 -1.155775 0.006502
O  -0.316082 -2.898574 -1.494808
N  -0.006591 0.015921 -0.008308
H  -0.427864 -1.911707 0.64409
C  -2.235358 -0.813015 0.627532
H  -0.424959 0.932289 -0.095048
H  -2.0832 -0.514007 1.664726
H  -2.723977 0.023196 0.128495
O  -0.392233 1.909307 -2.564187
H  0.395799 2.285505 -2.990113
H  -2.22521 0.57506 -1.669893
S  -3.408043 -2.180352 0.523085
H  -2.773015 -2.997985 1.371197
C  1.331947 0.039891 0.008195
O  1.924439 1.130059 -0.045874
C  2.145587 -1.234414 0.116278
H  2.829885 -1.056167 0.949493
H  1.53555 -2.095083 0.377762
C  2.940557 -1.629176 -1.148298
H  2.285522 -2.167301 -1.832472
H  3.706234 -2.340139 -0.833769
C  3.613286 -0.514236 -1.966649
H  4.415267 -0.955727 -2.562097
N  4.195285 0.562442 -1.109998
H  3.374142 0.932874 -0.509932
H  4.959964 0.224098 -0.532026
C  2.676606 0.190033 -2.94879
O  2.594576 1.393193 -3.012755
O  2.020918 -0.677446 -3.687325
H  1.341014 -0.21283 -4.222942
H  4.516421 1.336883 -1.691192
totalener: -1406.22771141 hartree
nucrepener: 1965.72668857 hartree
electener: -3371.95439997 hartree
oneelecener: -5814.36467954 hartree
twoeener: 2442.41027957 hartree
kineticenergy: 1400.63686182 hartree
exchangeener: -105.325193509778 hartree
correlationener: -7.060271905139 hartree
xcener: -112.385465414916 hartree
temp: 298.15 k
press: 1.00 atm
thermalcorrenthalpy: 0.00094421 hartree
totalenthalpy: -1405.98457483 hartree
totalentropycorr: -0.06436680 hartree
gibbsenthalpy: -1406.04894163 hartree
gibbsminuselec: 0.26317855 hartree
chargesum: 1.0000000
charge: -0.163684 0.196899 -0.063250 0.154570 0.303957 -0.352393 0.146896 0.011135 -0.322249 -0.161575 0.136889 -0.172961 0.194683 0.148273 0.110957 -0.252196 0.259867 0.099478 -0.100728 0.109066 0.263849 -0.375301 -0.214276 0.149998 0.126187 -0.233317 0.153348 0.143567 -0.028360 0.166451 -0.066944 0.225397 0.215635 0.302961 -0.346626 -0.258514 0.263733 0.228577
charge: 0.330794 -0.002577 -0.040807 0.045256 -0.425526 0.136221 -0.399873 -0.142125 0.101598 0.359155 0.038932 -0.247708 -0.002676 0.012427 0.000558 0.388337 -0.074897 0.019712 0.522621 -0.142621 -0.340539 0.146721 0.003513 0.037900 0.034859 0.009197 0.042454 0.035663 -0.053951 0.048310 0.595890 -0.060081 0.034793 -0.457217 0.111451 0.407423 -0.115305 0.042118
qa: -0.1637 0.1969 -0.0633 0.1546 0.3040 -0.3524 0.1469 0.0111 -0.3222 -0.1616 0.1369 -0.1730 0.1947 0.1483 0.1110 -0.2522 0.2599 0.0995 -0.1007 0.1091 0.2638 -0.3753 -0.2143 0.1500 0.1262 -0.2333 0.1533 0.1436 -0.0284 0.1665 -0.0669 0.2254 0.2156 0.3030 -0.3466 -0.2585 0.2637 0.2286
va: 3.1082 1.0181 3.8633 0.9970 4.2423 2.1284 4.3139 3.7735 2.1798 3.1959 1.0063 3.9937 1.0179 0.9973 1.0011 2.2331 1.0104 1.0286 2.1758 1.0239 4.1601 2.1465 3.8718 1.0035 1.0337 3.8160 1.0289 0.9966 3.8367 0.9983 3.5767 1.1016 0.9832 4.3561 2.1401 2.2684 1.0453 0.9900
dispcorr: -0.084554208 hartree
energy: -1406.319120269829
dipole: 8.11170 -4.90144 3.21026 -1.23964 2.10962 0.86999 6.94383 -5.85518 1.08865
magnitude: 3.49969 au
magnitude: 8.89551 debye
zeropoint: 0.31079118 hartree
thermalvibcorrection: 0.01812746 hartree
thermalrotcorrection: 0.00141627 hartree
thermaltrasncorrection: 0.00141627 hartree
thermaltotal: -1405.98736908 hartree
thermalcorr: 0.02096000 hartree
nonthermalcorr: 0.31079118 hartree
totalcorr: 0.33175119 hartree
totalenthalpy: -1405.98642487 hartree
