program: Orca
programVersion: 5.0.2
elementType: N H C H C O C C O N H C H H H O H H S H C O C H H C H H C H N H H C O O H H
charge: 1
multiplicity: 1
keywords: wB97X-D3BJ Opt Freq def2-TZVPP def2/J RIJCOSX VeryTightSCF
keywords: PAL8 defgrid3 TightOpt
frequency: 0.00 0.00 0.00 0.00 0.00 0.00 7.39 21.13 30.09 38.68 55.51 67.94 71.45 78.90 94.38 107.70 140.81 149.45 171.31 179.52 195.10 226.45 250.26 253.07 277.36 314.89 320.86 359.19 391.83 405.88 418.05 442.67 504.16 513.81 529.46 537.97 600.10 622.30 626.39 645.97 661.53 665.67 667.97 711.63 730.20 734.44 762.72 774.92 825.04 845.91 858.60 914.08 921.73 952.80 960.41 991.48 1014.83 1023.77 1030.97 1072.78 1117.48 1145.01 1173.29 1181.05 1190.87 1206.91 1211.49 1213.60 1246.29 1266.12 1270.17 1302.65 1309.48 1321.15 1333.97 1355.64 1382.90 1398.71 1416.65 1425.73 1456.34 1460.48 1462.33 1481.01 1493.78 1499.13 1520.33 1527.91 1554.72 1565.29 1637.58 1669.32 1709.89 1792.66 1853.55 1866.53 2258.31 2758.86 3072.79 3086.46 3111.19 3114.91 3117.46 3129.33 3131.76 3149.41 3162.44 3224.60 3426.31 3558.46 3584.07 3634.21 3786.33 3800.24
frequency: 7.39 21.13 30.09 38.68 55.51 67.94 71.45 78.90 94.38 107.70 140.81 149.45 171.31 179.52 195.10 226.45 250.26 253.07 277.36 314.89 320.86 359.19 391.83 405.88 418.05 442.67 504.16 513.81 529.46 537.97 600.10 622.30 626.39 645.97 661.53 665.67 667.97 711.63 730.20 734.44 762.72 774.92 825.04 845.91 858.60 914.08 921.73 952.80 960.41 991.48 1014.83 1023.77 1030.97 1072.78 1117.48 1145.01 1173.29 1181.05 1190.87 1206.91 1211.49 1213.60 1246.29 1266.12 1270.17 1302.65 1309.48 1321.15 1333.97 1355.64 1382.90 1398.71 1416.65 1425.73 1456.34 1460.48 1462.33 1481.01 1493.78 1499.13 1520.33 1527.91 1554.72 1565.29 1637.58 1669.32 1709.89 1792.66 1853.55 1866.53 2258.31 2758.86 3072.79 3086.46 3111.19 3114.91 3117.46 3129.33 3131.76 3149.41 3162.44 3224.60 3426.31 3558.46 3584.07 3634.21 3786.33 3800.24
formula: C10H18N3O6S
InChI: InChI=1S/C10H18N3O6S/c11-5(10(18)19)1-2-7(14)13-6(4-20)9(17)12-3-8(15)16/h5-6,12-13,15,18,20H,1-4H2,11H3
38 atoms
N  -1.829491 -2.365664 2.172107
H  -1.679913 -2.827366 3.061051
C  -3.208993 -2.27003 1.752764
H  -3.558103 -1.235608 1.684679
C  -4.070391 -2.972364 2.786782
O  -3.64141 -3.486019 3.782596
C  -0.746217 -1.802578 1.601198
C  -0.942211 -1.143731 0.223351
O  0.362479 -1.842202 2.101297
N  0.001852 -0.049893 0.042808
H  -1.919125 -0.66394 0.166903
C  -0.910001 -2.229891 -0.866628
H  -0.388378 0.877492 0.118558
H  -0.168323 -2.994922 -0.642228
H  -1.882882 -2.71744 -0.888744
O  -5.358242 -2.935813 2.43622
H  -5.871907 -3.386851 3.120395
H  -3.395309 -2.74999 0.788652
S  -0.583668 -1.459923 -2.474772
H  -0.902029 -2.531241 -3.210009
C  1.338008 -0.022995 -0.039861
O  1.891554 1.093388 -0.059715
C  2.162571 -1.284622 -0.135586
H  2.471182 -1.534385 0.881627
H  1.546216 -2.111832 -0.465744
C  3.367181 -1.164788 -1.080419
H  3.092832 -0.627998 -1.992784
H  3.654944 -2.171579 -1.38404
C  4.621258 -0.527379 -0.467425
H  4.860946 -1.014822 0.478233
N  4.427184 0.929949 -0.223726
H  4.808963 1.435052 -1.029741
H  4.929933 1.250888 0.599408
C  5.806266 -0.656763 -1.418825
O  6.255937 0.283342 -2.019187
O  6.236339 -1.909358 -1.507034
H  6.969118 -1.948029 -2.138741
H  3.351187 1.11349 -0.118685
totalener: -1406.24173478 hartree
nucrepener: 1758.24140363 hartree
electener: -3164.48313841 hartree
oneelecener: -5401.15645404 hartree
twoeener: 2236.67331563 hartree
kineticenergy: 1400.64137821 hartree
exchangeener: -105.324565711478 hartree
correlationener: -7.052240125150 hartree
xcener: -112.376805836628 hartree
temp: 298.15 k
press: 1.00 atm
thermalcorrenthalpy: 0.00094421 hartree
totalenthalpy: -1405.99137412 hartree
totalentropycorr: -0.06665307 hartree
gibbsenthalpy: -1406.05802719 hartree
gibbsminuselec: 0.26127466 hartree
chargesum: 1.0000000
charge: -0.175487 0.202329 -0.083841 0.131312 0.276435 -0.298452 0.223476 0.025064 -0.360978 -0.166289 0.126586 -0.216316 0.192733 0.127029 0.138362 -0.259939 0.245951 0.123138 -0.138884 0.120955 0.301930 -0.399064 -0.165845 0.141433 0.114134 -0.220444 0.134379 0.137031 0.020175 0.141768 -0.086789 0.217324 0.217604 0.280937 -0.295096 -0.244688 0.255129 0.216899
charge: 0.336314 -0.005941 -0.048092 0.031644 -0.434118 0.132943 -0.389043 -0.131948 0.091386 0.358077 0.036409 -0.233530 0.001735 -0.001595 0.006691 0.378007 -0.075177 0.027074 0.485877 -0.142202 -0.314834 0.162532 -0.004794 0.043654 0.029751 0.004183 0.037907 0.043092 -0.058637 0.043524 0.590167 0.028856 0.033411 -0.436887 0.137529 0.398260 -0.064856 -0.097368
qa: -0.1755 0.2023 -0.0838 0.1313 0.2764 -0.2985 0.2235 0.0251 -0.3610 -0.1663 0.1266 -0.2163 0.1927 0.1270 0.1384 -0.2599 0.2460 0.1231 -0.1389 0.1210 0.3019 -0.3991 -0.1658 0.1414 0.1141 -0.2204 0.1344 0.1370 0.0202 0.1418 -0.0868 0.2173 0.2176 0.2809 -0.2951 -0.2447 0.2551 0.2169
va: 3.1546 1.0300 3.8629 0.9954 4.3763 2.1955 4.3217 3.7665 2.1551 3.2063 1.0040 4.0429 1.0123 0.9879 1.0039 2.2330 1.0123 0.9953 2.1923 1.0183 4.2066 2.1196 3.8172 1.0189 1.0111 3.8777 1.0145 1.0168 3.8545 1.0089 3.5260 1.0149 0.9863 4.3641 2.1948 2.2652 1.0040 1.1184
dispcorr: -0.078126943 hartree
energy: -1406.324421170250
dipole: 3.23481 -1.52967 1.70514 -0.37517 0.87232 0.49715 -3.59759 2.73759 -0.86000
magnitude: 1.97339 au
magnitude: 5.01596 debye
zeropoint: 0.30959991 hartree
thermalvibcorrection: 0.01873127 hartree
thermalrotcorrection: 0.00141627 hartree
thermaltrasncorrection: 0.00141627 hartree
thermaltotal: -1405.99325745 hartree
thermalcorr: 0.02156381 hartree
nonthermalcorr: 0.30959991 hartree
totalcorr: 0.33116372 hartree
totalenthalpy: -1405.99231324 hartree
