program: Orca
programVersion: 5.0.2
elementType: N H C H C O C C O N H C H H H O H H S H C O C H H C H H C H N H H C O O H H
charge: 1
multiplicity: 1
keywords: wB97X-D3BJ Opt Freq def2-TZVPP def2/J RIJCOSX VeryTightSCF
keywords: PAL8 defgrid3 TightOpt
frequency: 0.00 0.00 0.00 0.00 0.00 0.00 20.23 24.89 34.11 45.58 46.73 55.34 73.69 82.79 94.50 116.81 156.01 169.20 183.52 208.95 226.63 260.28 265.18 283.04 298.76 307.03 331.41 361.35 387.47 426.95 435.99 461.84 489.01 513.24 514.69 540.27 566.26 573.89 585.61 608.84 627.15 651.22 682.39 730.79 734.51 744.15 750.74 770.20 804.96 843.70 865.97 881.87 890.07 922.15 944.11 986.42 996.65 1029.57 1043.19 1064.48 1134.91 1150.95 1160.06 1169.49 1196.25 1203.17 1207.88 1229.77 1241.18 1284.01 1301.09 1304.05 1316.02 1319.80 1338.53 1341.24 1368.85 1402.57 1407.81 1427.53 1432.53 1453.80 1468.58 1479.86 1485.41 1493.20 1513.76 1517.56 1518.75 1565.37 1620.17 1669.19 1707.16 1792.89 1876.53 1885.98 2025.01 2750.41 3069.26 3089.06 3102.08 3106.63 3110.79 3134.00 3151.87 3154.57 3170.95 3183.94 3508.24 3579.66 3610.66 3641.14 3792.05 3851.11
frequency: 20.23 24.89 34.11 45.58 46.73 55.34 73.69 82.79 94.50 116.81 156.01 169.20 183.52 208.95 226.63 260.28 265.18 283.04 298.76 307.03 331.41 361.35 387.47 426.95 435.99 461.84 489.01 513.24 514.69 540.27 566.26 573.89 585.61 608.84 627.15 651.22 682.39 730.79 734.51 744.15 750.74 770.20 804.96 843.70 865.97 881.87 890.07 922.15 944.11 986.42 996.65 1029.57 1043.19 1064.48 1134.91 1150.95 1160.06 1169.49 1196.25 1203.17 1207.88 1229.77 1241.18 1284.01 1301.09 1304.05 1316.02 1319.80 1338.53 1341.24 1368.85 1402.57 1407.81 1427.53 1432.53 1453.80 1468.58 1479.86 1485.41 1493.20 1513.76 1517.56 1518.75 1565.37 1620.17 1669.19 1707.16 1792.89 1876.53 1885.98 2025.01 2750.41 3069.26 3089.06 3102.08 3106.63 3110.79 3134.00 3151.87 3154.57 3170.95 3183.94 3508.24 3579.66 3610.66 3641.14 3792.05 3851.11
formula: C10H18N3O6S
InChI: InChI=1S/C10H18N3O6S/c11-5(10(18)19)1-2-7(14)13-6(4-20)9(17)12-3-8(15)16/h5-6,12-13,15,18,20H,1-4H2,11H3
38 atoms
N  -2.251251 -1.397681 2.223872
H  -2.199158 -1.691887 3.187105
C  -3.437317 -0.689694 1.813583
H  -3.821661 -1.062477 0.858284
C  -3.234792 0.821986 1.665982
O  -2.156888 1.327809 1.528263
C  -1.057202 -1.483015 1.579502
C  -0.962712 -1.005174 0.12167
O  -0.078742 -1.961095 2.120067
N  0.03498 0.053248 0.026836
H  -1.885933 -0.520719 -0.186533
C  -0.77345 -2.219899 -0.793819
H  -0.345601 0.984529 0.127145
H  0.027005 -2.864866 -0.439744
H  -1.68727 -2.813838 -0.751631
O  -4.350393 1.559479 1.632298
H  -5.141575 1.034756 1.793375
H  -4.215594 -0.890613 2.551499
S  -0.373125 -1.823825 -2.507647
H  -1.477518 -1.12042 -2.784957
C  1.365825 0.030233 -0.000228
O  1.960306 1.132451 -0.021342
C  2.120472 -1.27687 -0.028185
H  1.605525 -1.97064 0.632418
H  2.054228 -1.675203 -1.043409
C  3.582743 -1.215631 0.426906
H  3.929757 -2.244772 0.515378
H  3.649957 -0.778497 1.426665
C  4.584496 -0.499575 -0.485209
H  5.597308 -0.763129 -0.170447
N  4.438531 0.983073 -0.381369
H  4.789761 1.451599 -1.213785
H  3.339454 1.162736 -0.241864
C  4.476265 -0.965793 -1.933585
O  4.269212 -2.102454 -2.236025
O  4.679869 0.035013 -2.808336
H  4.637739 -0.324613 -3.705736
H  4.931963 1.341266 0.431635
totalener: -1406.23107857 hartree
nucrepener: 1839.56925082 hartree
electener: -3245.80032939 hartree
oneelecener: -5564.16627648 hartree
twoeener: 2318.36594709 hartree
kineticenergy: 1400.63494899 hartree
exchangeener: -105.322720350836 hartree
correlationener: -7.053595227901 hartree
xcener: -112.376315578737 hartree
temp: 298.15 k
press: 1.00 atm
thermalcorrenthalpy: 0.00094421 hartree
totalenthalpy: -1405.98332211 hartree
totalentropycorr: -0.06598400 hartree
gibbsenthalpy: -1406.04930611 hartree
gibbsminuselec: 0.26125610 hartree
chargesum: 1.0000000
charge: -0.175642 0.193127 -0.167587 0.141567 0.328130 -0.309037 0.217852 -0.012165 -0.364815 -0.117880 0.102838 -0.150325 0.206003 0.136285 0.138535 -0.205846 0.220051 0.134904 -0.129064 0.098973 0.292663 -0.396752 -0.184341 0.155794 0.127347 -0.233118 0.140138 0.128463 -0.011186 0.148525 -0.089552 0.213015 0.217159 0.281245 -0.254428 -0.282802 0.251919 0.210005
charge: 0.331185 -0.005314 -0.069135 0.033462 -0.438550 0.137141 -0.371475 -0.134817 0.099669 0.370007 0.030189 -0.242942 0.002351 0.011893 0.013856 0.399011 -0.093457 0.035857 0.495016 -0.148470 -0.303604 0.181696 -0.005868 0.030541 0.031717 0.007966 0.048109 0.036297 -0.060596 0.047300 0.574934 0.016317 -0.116323 -0.432146 0.164094 0.363914 -0.068668 0.028839
qa: -0.1756 0.1931 -0.1676 0.1416 0.3281 -0.3090 0.2179 -0.0122 -0.3648 -0.1179 0.1028 -0.1503 0.2060 0.1363 0.1385 -0.2058 0.2201 0.1349 -0.1291 0.0990 0.2927 -0.3968 -0.1843 0.1558 0.1273 -0.2331 0.1401 0.1285 -0.0112 0.1485 -0.0896 0.2130 0.2172 0.2812 -0.2544 -0.2828 0.2519 0.2100
va: 3.1493 1.0126 3.9061 0.9829 4.2348 2.1720 4.3282 3.9166 2.1507 3.1988 1.0035 3.9580 1.0161 0.9994 1.0016 2.2711 1.0213 0.9994 2.1710 1.0242 4.1818 2.1165 3.7422 1.0288 1.0248 3.9917 1.0061 1.0066 3.8431 1.0015 3.4763 1.0061 1.1220 4.3547 2.2523 2.1938 1.0094 0.9883
dispcorr: -0.080305055 hartree
energy: -1406.315595869398
dipole: 2.99443 -2.08582 0.90861 -2.07876 2.76809 0.68933 2.18539 -2.01714 0.16825
magnitude: 1.15285 au
magnitude: 2.93031 debye
zeropoint: 0.30921946 hartree
thermalvibcorrection: 0.01846617 hartree
thermalrotcorrection: 0.00141627 hartree
thermaltrasncorrection: 0.00141627 hartree
thermaltotal: -1405.98507770 hartree
thermalcorr: 0.02129871 hartree
nonthermalcorr: 0.30921946 hartree
totalcorr: 0.33051817 hartree
totalenthalpy: -1405.98413349 hartree
