program: Orca
programVersion: 5.0.2
elementType: N H C H C O C C O N H C H H H O H H S H C O C H H C H H C H N H H C O O H H
charge: 1
multiplicity: 1
keywords: wB97X-D3BJ Opt Freq def2-TZVPP def2/J RIJCOSX VeryTightSCF
keywords: PAL8 defgrid3 TightOpt
frequency: 0.00 0.00 0.00 0.00 0.00 0.00 29.19 38.62 49.37 56.12 59.66 63.05 75.56 81.77 103.95 112.20 133.12 154.14 172.28 192.74 220.32 225.01 253.31 259.19 300.90 311.27 329.29 343.97 372.29 400.57 423.94 441.38 477.25 503.51 508.36 542.26 586.74 594.18 601.80 612.29 650.35 656.59 672.65 688.51 707.80 731.05 739.93 770.03 775.29 812.60 855.37 863.53 903.64 936.25 967.49 973.67 1006.02 1016.86 1064.84 1069.02 1108.11 1146.90 1168.90 1176.92 1182.91 1212.97 1214.23 1249.39 1256.50 1279.29 1296.89 1304.86 1315.20 1327.50 1341.46 1353.95 1373.91 1393.39 1415.49 1426.30 1439.82 1454.34 1467.01 1475.03 1478.66 1489.15 1490.81 1507.35 1521.92 1544.05 1659.61 1689.29 1770.77 1795.13 1823.74 1842.33 2761.97 3060.95 3072.46 3084.94 3088.28 3120.07 3122.41 3130.56 3131.79 3137.76 3161.80 3179.63 3422.57 3524.47 3609.11 3633.63 3785.97 3831.66
frequency: 29.19 38.62 49.37 56.12 59.66 63.05 75.56 81.77 103.95 112.20 133.12 154.14 172.28 192.74 220.32 225.01 253.31 259.19 300.90 311.27 329.29 343.97 372.29 400.57 423.94 441.38 477.25 503.51 508.36 542.26 586.74 594.18 601.80 612.29 650.35 656.59 672.65 688.51 707.80 731.05 739.93 770.03 775.29 812.60 855.37 863.53 903.64 936.25 967.49 973.67 1006.02 1016.86 1064.84 1069.02 1108.11 1146.90 1168.90 1176.92 1182.91 1212.97 1214.23 1249.39 1256.50 1279.29 1296.89 1304.86 1315.20 1327.50 1341.46 1353.95 1373.91 1393.39 1415.49 1426.30 1439.82 1454.34 1467.01 1475.03 1478.66 1489.15 1490.81 1507.35 1521.92 1544.05 1659.61 1689.29 1770.77 1795.13 1823.74 1842.33 2761.97 3060.95 3072.46 3084.94 3088.28 3120.07 3122.41 3130.56 3131.79 3137.76 3161.80 3179.63 3422.57 3524.47 3609.11 3633.63 3785.97 3831.66
formula: C10H18N3O6S
InChI: InChI=1S/C10H18N3O6S/c11-5(10(18)19)1-2-7(14)13-6(4-20)9(17)12-3-8(15)16/h5-6,12-13,15,18,20H,1-4H2,11H3
38 atoms
N  -1.374815 -1.014818 -2.523645
H  -1.556182 -1.605521 -3.321204
C  -0.978861 0.334745 -2.80627
H  -1.476726 0.655847 -3.72586
C  0.519118 0.487176 -3.018344
O  1.277058 -0.458228 -3.04196
C  -1.174501 -1.762364 -1.391612
C  -0.878016 -1.116292 -0.025901
O  -1.318561 -2.965937 -1.422206
N  0.007717 0.026261 -0.010606
H  -0.42737 -1.935955 0.533732
C  -2.200406 -0.791291 0.684897
H  -0.4156 0.938509 0.081635
H  -2.870532 -1.642204 0.573201
H  -2.015981 -0.64816 1.747671
O  0.990288 1.714085 -3.1939
H  0.302602 2.386168 -3.118883
H  -1.310693 1.020864 -2.026153
S  -3.054028 0.680359 0.045536
H  -2.788298 1.495833 1.071005
C  1.367006 0.023597 0.004785
O  1.992884 1.070724 0.034473
C  2.061734 -1.329013 -0.037567
H  1.756846 -1.906779 0.838391
H  1.696844 -1.892856 -0.900678
C  3.58619 -1.208276 -0.02012
H  4.026781 -2.209834 0.015807
H  3.897676 -0.690477 0.885932
C  4.184178 -0.42825 -1.187593
H  3.765423 0.579494 -1.190595
N  3.860376 -1.047521 -2.512406
H  3.86563 -2.065224 -2.453643
H  2.922271 -0.738571 -2.850324
C  5.702175 -0.311213 -1.150472
O  6.383217 -0.526946 -2.12102
O  6.150446 0.075567 0.03391
H  7.112731 0.173764 -0.010397
H  4.603321 -0.786757 -3.169644
totalener: -1406.23268750 hartree
nucrepener: 1886.53952369 hartree
electener: -3292.77221119 hartree
oneelecener: -5656.64936116 hartree
twoeener: 2363.87714997 hartree
kineticenergy: 1400.65191652 hartree
exchangeener: -105.323512022738 hartree
correlationener: -7.054654736042 hartree
xcener: -112.378166758780 hartree
temp: 298.15 k
press: 1.00 atm
thermalcorrenthalpy: 0.00094421 hartree
totalenthalpy: -1405.98558110 hartree
totalentropycorr: -0.06595686 hartree
gibbsenthalpy: -1406.05153796 hartree
gibbsminuselec: 0.26330952 hartree
chargesum: 1.0000000
charge: -0.179659 0.187584 -0.156834 0.170764 0.400103 -0.387429 0.156586 0.012206 -0.299410 -0.181822 0.129410 -0.153110 0.164545 0.150861 0.138092 -0.201906 0.236319 0.107191 -0.150833 0.121498 0.188902 -0.354215 -0.192004 0.142426 0.118673 -0.224870 0.123729 0.138957 0.007617 0.164490 -0.063208 0.218048 0.233677 0.297818 -0.309393 -0.236115 0.253085 0.228227
charge: 0.324683 -0.006271 -0.076688 0.045595 -0.410345 0.154544 -0.387146 -0.149149 0.111013 0.328302 0.043408 -0.216057 -0.032194 0.023302 0.013926 0.413270 -0.076538 0.010908 0.508936 -0.148226 -0.386901 0.084976 -0.014324 0.041640 0.027930 -0.001031 0.032964 0.048225 -0.049464 0.042251 0.612506 0.048829 -0.040188 -0.432566 0.128329 0.406963 -0.063547 0.038135
qa: -0.1797 0.1876 -0.1568 0.1708 0.4001 -0.3874 0.1566 0.0122 -0.2994 -0.1818 0.1294 -0.1531 0.1645 0.1509 0.1381 -0.2019 0.2363 0.1072 -0.1508 0.1215 0.1889 -0.3542 -0.1920 0.1424 0.1187 -0.2249 0.1237 0.1390 0.0076 0.1645 -0.0632 0.2180 0.2337 0.2978 -0.3094 -0.2361 0.2531 0.2282
va: 3.0785 1.0194 3.8642 0.9865 4.1260 2.1374 4.3606 3.8181 2.2310 3.0345 1.0251 3.9048 1.0600 1.0088 0.9993 2.2964 1.0124 1.0588 2.1860 1.0167 4.2543 2.1479 3.7650 1.0091 1.0178 3.9220 1.0042 1.0226 3.7645 1.0378 3.5813 0.9876 1.0776 4.3723 2.1849 2.2722 1.0065 1.0057
dispcorr: -0.082784751 hartree
energy: -1406.320287127959
dipole: 0.73574 0.81282 1.54856 -2.51755 2.99978 0.48223 3.07288 -3.71003 -0.63715
magnitude: 1.74256 au
magnitude: 4.42925 debye
zeropoint: 0.31061715 hartree
thermalvibcorrection: 0.01863028 hartree
thermalrotcorrection: 0.00141627 hartree
thermaltrasncorrection: 0.00141627 hartree
thermaltotal: -1405.98820715 hartree
thermalcorr: 0.02146282 hartree
nonthermalcorr: 0.31061715 hartree
totalcorr: 0.33207998 hartree
totalenthalpy: -1405.98726294 hartree
