program: Orca
programVersion: 5.0.2
elementType: N H C H C O C C O N H C H H H O H H S H C O C H H C H H C H N H H C O O H H
charge: 1
multiplicity: 1
keywords: wB97X-D3BJ Opt Freq def2-TZVPP def2/J RIJCOSX VeryTightSCF
keywords: PAL8 defgrid3 TightOpt
frequency: 0.00 0.00 0.00 0.00 0.00 0.00 26.53 36.45 43.07 50.62 59.42 64.50 73.54 98.22 121.80 144.91 147.35 161.15 187.28 207.83 231.73 248.82 258.46 274.10 300.90 316.74 323.94 352.77 374.42 406.87 450.80 461.13 500.26 520.69 528.46 537.95 548.97 570.59 584.56 610.68 621.08 633.49 638.85 690.18 714.11 730.00 746.21 753.38 804.51 824.81 850.87 887.61 894.36 915.94 936.79 976.27 1017.53 1029.94 1066.70 1085.49 1122.88 1141.17 1154.28 1163.86 1179.04 1202.83 1211.32 1214.90 1252.82 1263.82 1280.90 1298.09 1318.10 1326.38 1353.19 1357.28 1368.69 1383.09 1394.03 1405.47 1416.38 1431.45 1458.18 1472.41 1478.15 1480.01 1491.75 1498.01 1529.96 1569.27 1634.13 1684.33 1741.45 1812.33 1855.59 1892.78 2753.52 3052.18 3084.06 3098.51 3101.54 3105.62 3130.34 3136.49 3150.69 3161.49 3181.82 3188.01 3285.34 3515.17 3614.82 3629.00 3791.22 3792.52
frequency: 26.53 36.45 43.07 50.62 59.42 64.50 73.54 98.22 121.80 144.91 147.35 161.15 187.28 207.83 231.73 248.82 258.46 274.10 300.90 316.74 323.94 352.77 374.42 406.87 450.80 461.13 500.26 520.69 528.46 537.95 548.97 570.59 584.56 610.68 621.08 633.49 638.85 690.18 714.11 730.00 746.21 753.38 804.51 824.81 850.87 887.61 894.36 915.94 936.79 976.27 1017.53 1029.94 1066.70 1085.49 1122.88 1141.17 1154.28 1163.86 1179.04 1202.83 1211.32 1214.90 1252.82 1263.82 1280.90 1298.09 1318.10 1326.38 1353.19 1357.28 1368.69 1383.09 1394.03 1405.47 1416.38 1431.45 1458.18 1472.41 1478.15 1480.01 1491.75 1498.01 1529.96 1569.27 1634.13 1684.33 1741.45 1812.33 1855.59 1892.78 2753.52 3052.18 3084.06 3098.51 3101.54 3105.62 3130.34 3136.49 3150.69 3161.49 3181.82 3188.01 3285.34 3515.17 3614.82 3629.00 3791.22 3792.52
formula: C10H18N3O6S
InChI: InChI=1S/C10H18N3O6S/c11-5(10(18)19)1-2-7(14)13-6(4-20)9(17)12-3-8(15)16/h5-6,12-13,15,18,20H,1-4H2,11H3
38 atoms
N  -1.094102 -1.993974 1.995066
H  -1.398391 -2.812753 2.500523
C  -0.991933 -0.737202 2.70189
H  -1.363197 0.10537 2.125087
C  0.449619 -0.432687 3.102224
O  0.92557 0.672807 3.143677
C  -0.925594 -2.239317 0.644926
C  -0.929217 -1.051916 -0.334709
O  -0.889378 -3.376083 0.23907
N  0.016091 0.021872 -0.043634
H  -1.912787 -0.590526 -0.203119
C  -0.855687 -1.545448 -1.780572
H  -0.339219 0.953613 -0.206898
H  0.073743 -2.074272 -1.980577
H  -1.657903 -2.261238 -1.951268
O  1.211932 -1.495176 3.402755
H  0.724564 -2.314142 3.24312
H  -1.585811 -0.791255 3.617439
S  -1.107665 -0.209533 -2.969772
H  0.114628 0.32926 -2.892818
C  1.365738 0.003108 -0.004634
O  1.98219 1.069529 -0.037987
C  2.094645 -1.32126 0.117681
H  1.626403 -1.949779 0.875539
H  1.964867 -1.85727 -0.825759
C  3.593027 -1.164678 0.382868
H  4.032273 -0.496451 -0.361013
H  4.071026 -2.13623 0.260603
C  3.980224 -0.686094 1.787877
H  3.50126 -1.313482 2.540378
N  3.550645 0.730843 2.054877
H  4.33116 1.286644 2.401825
H  3.157734 1.129574 1.172413
C  5.485121 -0.859691 1.989143
O  6.049626 -1.88378 1.753729
O  6.075514 0.24978 2.470734
H  7.019168 0.072783 2.592301
H  2.769157 0.766531 2.727815
totalener: -1406.22582302 hartree
nucrepener: 1896.56466134 hartree
electener: -3302.79048436 hartree
oneelecener: -5675.27167468 hartree
twoeener: 2372.48119032 hartree
kineticenergy: 1400.63095413 hartree
exchangeener: -105.315275050403 hartree
correlationener: -7.056469630517 hartree
xcener: -112.371744680920 hartree
temp: 298.15 k
press: 1.00 atm
thermalcorrenthalpy: 0.00094421 hartree
totalenthalpy: -1405.98032699 hartree
totalentropycorr: -0.06521825 hartree
gibbsenthalpy: -1406.04554524 hartree
gibbsminuselec: 0.26357245 hartree
chargesum: 1.0000000
charge: -0.264418 0.206020 -0.057658 0.127641 0.292460 -0.323546 0.157577 0.008279 -0.273611 -0.212884 0.139850 -0.136831 0.210687 0.118722 0.145275 -0.250346 0.237411 0.160346 -0.125252 0.100520 0.188655 -0.372187 -0.147238 0.103960 0.152477 -0.235537 0.138961 0.148004 0.002636 0.135926 -0.059075 0.219162 0.228422 0.285325 -0.250248 -0.286015 0.254431 0.232097
charge: 0.306421 -0.016427 -0.049440 0.036566 -0.426736 0.147659 -0.380816 -0.150333 0.136378 0.338113 0.047258 -0.241600 -0.002615 0.004056 0.024001 0.384193 -0.101082 0.047247 0.499994 -0.153740 -0.365735 0.114164 -0.003873 0.028516 0.046116 0.007851 0.038278 0.047241 -0.043336 0.039267 0.607178 0.020003 -0.026684 -0.427136 0.168379 0.363826 -0.066275 0.003120
qa: -0.2644 0.2060 -0.0577 0.1276 0.2925 -0.3235 0.1576 0.0083 -0.2736 -0.2129 0.1398 -0.1368 0.2107 0.1187 0.1453 -0.2503 0.2374 0.1603 -0.1253 0.1005 0.1887 -0.3722 -0.1472 0.1040 0.1525 -0.2355 0.1390 0.1480 0.0026 0.1359 -0.0591 0.2192 0.2284 0.2853 -0.2502 -0.2860 0.2544 0.2321
va: 3.0419 1.0043 3.8371 1.0211 4.2070 2.1865 4.3222 3.7310 2.2385 3.0866 1.0013 3.9962 1.0081 1.0112 1.0108 2.1977 1.0216 0.9900 2.1649 1.0265 4.2112 2.1122 3.7565 1.0309 1.0030 3.9487 1.0074 1.0188 3.7918 1.0355 3.5498 1.0078 1.0624 4.3530 2.2552 2.1903 1.0059 1.0436
dispcorr: -0.083891800 hartree
energy: -1406.314882071103
dipole: 0.22004 0.51529 0.73532 -0.23836 0.94724 0.70888 0.87778 1.29006 2.16784
magnitude: 2.39640 au
magnitude: 6.09116 debye
zeropoint: 0.31041020 hartree
thermalvibcorrection: 0.01836512 hartree
thermalrotcorrection: 0.00141627 hartree
thermaltrasncorrection: 0.00141627 hartree
thermaltotal: -1405.98327421 hartree
thermalcorr: 0.02119766 hartree
nonthermalcorr: 0.31041020 hartree
totalcorr: 0.33160786 hartree
totalenthalpy: -1405.98233000 hartree
