program: Orca
programVersion: 5.0.2
elementType: N H C H C O C C O N H C H H H O H H S H C O C H H C H H C H N H H C O O H H
charge: 1
multiplicity: 1
keywords: wB97X-D3BJ Opt Freq def2-TZVPP def2/J RIJCOSX VeryTightSCF
keywords: PAL8 defgrid3 TightOpt
frequency: 0.00 0.00 0.00 0.00 0.00 0.00 20.79 29.84 39.68 50.21 65.54 81.11 89.42 104.72 113.95 122.21 129.75 136.35 164.94 184.86 204.65 217.08 239.18 252.05 267.11 295.52 308.28 319.64 345.34 350.16 386.24 439.56 493.51 516.73 530.77 578.44 593.05 614.49 620.05 629.84 661.77 699.97 709.18 739.65 746.95 762.82 791.36 799.71 811.30 828.83 862.43 882.42 898.93 902.77 963.00 983.71 996.27 1019.12 1045.89 1091.72 1099.99 1107.08 1144.64 1147.74 1160.08 1208.07 1220.06 1228.62 1264.46 1278.08 1288.27 1295.70 1306.47 1334.28 1357.37 1365.61 1376.22 1381.79 1392.85 1402.95 1428.92 1437.27 1459.90 1471.43 1479.31 1484.93 1486.77 1497.37 1511.58 1526.34 1649.85 1671.66 1787.48 1820.13 1839.88 1883.03 2755.62 3072.37 3096.24 3101.61 3112.57 3128.97 3154.48 3162.84 3165.72 3179.39 3199.46 3220.81 3411.87 3499.75 3536.23 3607.29 3621.91 3693.78
frequency: 20.79 29.84 39.68 50.21 65.54 81.11 89.42 104.72 113.95 122.21 129.75 136.35 164.94 184.86 204.65 217.08 239.18 252.05 267.11 295.52 308.28 319.64 345.34 350.16 386.24 439.56 493.51 516.73 530.77 578.44 593.05 614.49 620.05 629.84 661.77 699.97 709.18 739.65 746.95 762.82 791.36 799.71 811.30 828.83 862.43 882.42 898.93 902.77 963.00 983.71 996.27 1019.12 1045.89 1091.72 1099.99 1107.08 1144.64 1147.74 1160.08 1208.07 1220.06 1228.62 1264.46 1278.08 1288.27 1295.70 1306.47 1334.28 1357.37 1365.61 1376.22 1381.79 1392.85 1402.95 1428.92 1437.27 1459.90 1471.43 1479.31 1484.93 1486.77 1497.37 1511.58 1526.34 1649.85 1671.66 1787.48 1820.13 1839.88 1883.03 2755.62 3072.37 3096.24 3101.61 3112.57 3128.97 3154.48 3162.84 3165.72 3179.39 3199.46 3220.81 3411.87 3499.75 3536.23 3607.29 3621.91 3693.78
formula: C10H18N3O6S
InChI: InChI=1S/C10H18N3O6S/c11-5(10(18)19)1-2-7(14)13-6(4-20)9(17)12-3-8(15)16/h5-6,12-13,15,18,20H,1-4H2,11H3
38 atoms
N  -2.246598 -1.252375 -2.303645
H  -3.023817 -0.878866 -2.829494
C  -1.8298 -2.605283 -2.620844
H  -1.924524 -3.280051 -1.767405
C  -0.397475 -2.696866 -3.127694
O  0.128783 -3.755699 -3.379566
C  -2.106433 -0.636681 -1.075802
C  -0.994717 -1.119996 -0.134404
O  -2.767741 0.330067 -0.778959
N  -0.020614 -0.041311 -0.087933
H  -0.520876 -2.016301 -0.523288
C  -1.59449 -1.445436 1.231723
H  -0.398642 0.890977 0.016926
H  -0.808714 -1.7921 1.903184
H  -2.049439 -0.557666 1.666985
O  0.266775 -1.548634 -3.250707
H  -0.343548 -0.820107 -3.047925
H  -2.473385 -3.005848 -3.404573
S  -2.816339 -2.776251 1.108111
H  -3.858525 -2.001157 0.786152
C  1.341795 -0.09179 -0.110617
O  2.012559 0.921386 -0.098136
C  2.021291 -1.45262 -0.154674
H  2.324595 -1.702097 0.865761
H  1.353385 -2.242444 -0.48273
C  3.241026 -1.361398 -1.071366
H  3.955039 -0.650854 -0.649751
H  2.922294 -0.971628 -2.04316
C  3.917673 -2.716262 -1.296839
H  4.382203 -3.112792 -0.395778
N  4.995505 -2.526169 -2.34105
H  4.533007 -2.419199 -3.250539
H  5.555533 -1.69499 -2.146644
C  2.887855 -3.706183 -1.836095
O  2.251093 -4.414318 -1.114544
O  2.742717 -3.560022 -3.152795
H  1.823367 -3.840651 -3.417171
H  5.618435 -3.332371 -2.402378
totalener: -1406.21033952 hartree
nucrepener: 1908.08018156 hartree
electener: -3314.29052108 hartree
oneelecener: -5699.60421278 hartree
twoeener: 2385.31369171 hartree
kineticenergy: 1400.60845508 hartree
exchangeener: -105.308303980948 hartree
correlationener: -7.053961857295 hartree
xcener: -112.362265838243 hartree
temp: 298.15 k
press: 1.00 atm
thermalcorrenthalpy: 0.00094421 hartree
totalenthalpy: -1405.96352898 hartree
totalentropycorr: -0.06562192 hartree
gibbsenthalpy: -1406.02915089 hartree
gibbsminuselec: 0.26291195 hartree
chargesum: 1.0000000
charge: -0.226649 0.205921 -0.058926 0.137558 0.292999 -0.326437 0.133604 -0.012412 -0.287010 -0.175049 0.075878 -0.135494 0.206174 0.120317 0.144830 -0.241182 0.240289 0.150135 -0.144872 0.127083 0.192746 -0.338649 -0.165773 0.131497 0.083356 -0.233553 0.140042 0.120719 0.050531 0.179478 -0.060905 0.244988 0.240476 0.243217 -0.236969 -0.332314 0.268222 0.246132
charge: 0.311271 -0.009588 -0.048439 0.033518 -0.421538 0.174626 -0.391133 -0.164335 0.128212 0.338659 0.018249 -0.230830 0.000619 0.010042 0.016629 0.385694 -0.103052 0.048050 0.503588 -0.140345 -0.386589 0.094456 0.002429 0.041796 0.013926 -0.008262 0.035840 0.035625 -0.038898 0.046049 0.616882 0.051828 0.058715 -0.470055 0.170207 0.347819 -0.132429 0.060767
qa: -0.2266 0.2059 -0.0589 0.1376 0.2930 -0.3264 0.1336 -0.0124 -0.2870 -0.1750 0.0759 -0.1355 0.2062 0.1203 0.1448 -0.2412 0.2403 0.1501 -0.1449 0.1271 0.1927 -0.3386 -0.1658 0.1315 0.0834 -0.2336 0.1400 0.1207 0.0505 0.1795 -0.0609 0.2450 0.2405 0.2432 -0.2370 -0.3323 0.2682 0.2461
va: 3.0156 1.0032 3.8040 1.0422 4.2033 2.2011 4.3909 3.9583 2.2385 3.0868 1.0047 3.9578 1.0159 1.0071 1.0142 2.2174 1.0329 1.0029 2.1878 1.0194 4.3408 2.1882 3.8499 1.0130 1.0322 3.9294 1.0256 1.0207 3.7679 0.9974 3.6476 0.9927 0.9687 4.3710 2.2581 2.1511 1.0719 0.9663
dispcorr: -0.081853418 hartree
energy: -1406.298515332186
dipole: 9.72939 -5.09953 4.62986 0.58507 -1.48129 -0.89623 -0.08190 -1.91467 -1.99658
magnitude: 5.12105 au
magnitude: 13.01668 debye
zeropoint: 0.31040022 hartree
thermalvibcorrection: 0.01870381 hartree
thermalrotcorrection: 0.00141627 hartree
thermaltrasncorrection: 0.00141627 hartree
thermaltotal: -1405.96657876 hartree
thermalcorr: 0.02153635 hartree
nonthermalcorr: 0.31040022 hartree
totalcorr: 0.33193657 hartree
totalenthalpy: -1405.96563455 hartree
