program: Orca
programVersion: 5.0.2
elementType: N H C H C O C C O N H C H H H O H H S H C O C H H C H H C H N H H C O O H H
charge: 1
multiplicity: 1
keywords: wB97X-D3BJ Opt Freq def2-TZVPP def2/J RIJCOSX VeryTightSCF
keywords: PAL8 defgrid3 TightOpt
frequency: 0.00 0.00 0.00 0.00 0.00 0.00 37.37 45.09 53.64 61.45 78.43 80.22 92.76 111.69 122.95 135.24 151.35 165.19 188.17 206.36 221.64 228.44 242.10 276.99 287.05 301.90 329.82 339.91 386.62 396.49 411.46 469.88 484.38 501.35 516.51 560.79 574.92 598.60 625.00 639.93 647.52 670.46 674.65 729.64 742.38 760.84 774.77 802.88 838.07 852.42 862.17 887.24 914.52 919.58 940.13 989.51 1018.89 1029.77 1042.73 1095.45 1119.70 1148.60 1154.09 1171.45 1197.99 1215.29 1242.56 1265.81 1271.82 1276.64 1292.54 1303.84 1320.83 1344.28 1358.83 1367.55 1379.55 1398.75 1404.24 1411.92 1432.17 1469.44 1472.49 1473.78 1478.59 1497.73 1507.63 1521.10 1531.31 1544.22 1600.72 1677.76 1720.75 1798.57 1820.86 1846.78 2604.86 2747.88 3038.37 3091.36 3096.15 3097.64 3110.17 3135.91 3138.81 3153.10 3166.42 3168.32 3398.99 3486.05 3544.60 3575.44 3612.73 3845.68
frequency: 37.37 45.09 53.64 61.45 78.43 80.22 92.76 111.69 122.95 135.24 151.35 165.19 188.17 206.36 221.64 228.44 242.10 276.99 287.05 301.90 329.82 339.91 386.62 396.49 411.46 469.88 484.38 501.35 516.51 560.79 574.92 598.60 625.00 639.93 647.52 670.46 674.65 729.64 742.38 760.84 774.77 802.88 838.07 852.42 862.17 887.24 914.52 919.58 940.13 989.51 1018.89 1029.77 1042.73 1095.45 1119.70 1148.60 1154.09 1171.45 1197.99 1215.29 1242.56 1265.81 1271.82 1276.64 1292.54 1303.84 1320.83 1344.28 1358.83 1367.55 1379.55 1398.75 1404.24 1411.92 1432.17 1469.44 1472.49 1473.78 1478.59 1497.73 1507.63 1521.10 1531.31 1544.22 1600.72 1677.76 1720.75 1798.57 1820.86 1846.78 2604.86 2747.88 3038.37 3091.36 3096.15 3097.64 3110.17 3135.91 3138.81 3153.10 3166.42 3168.32 3398.99 3486.05 3544.60 3575.44 3612.73 3845.68
formula: C10H18N3O6S
InChI: InChI=1S/C10H18N3O6S/c11-5(10(18)19)1-2-7(14)13-6(4-20)9(17)12-3-8(15)16/h5-6,12-13,15,18,20H,1-4H2,11H3
38 atoms
N  -0.666652 -2.163591 -2.027873
H  -0.588913 -3.047087 -2.512616
C  -0.949623 -1.020618 -2.859333
H  -2.024888 -0.884554 -3.031854
C  -0.274914 -1.202814 -4.214233
O  0.496816 -2.097995 -4.454279
C  -0.734213 -2.314914 -0.67183
C  -0.891224 -1.097584 0.25209
O  -0.662961 -3.41459 -0.166852
N  -0.010107 0.027971 -0.03075
H  -0.680302 -1.499653 1.24543
C  -2.355046 -0.637886 0.22387
H  -0.421456 0.941104 0.132241
H  -2.64883 -0.341115 -0.784112
H  -2.986747 -1.475015 0.516462
O  -0.591196 -0.318373 -5.151031
H  -1.23745 0.326978 -4.84428
H  -0.555678 -0.103976 -2.417659
S  -2.698238 0.809276 1.248955
H  -2.42372 0.240516 2.429801
C  1.333642 0.027757 -0.035999
O  1.941992 1.107155 -0.053424
C  2.053946 -1.303585 -0.029577
H  1.884951 -1.766891 0.947052
H  1.590863 -1.975627 -0.749741
C  3.559511 -1.237434 -0.301015
H  3.936158 -2.259815 -0.302084
H  4.077961 -0.71208 0.504517
C  3.957421 -0.594458 -1.643416
H  4.917505 -0.983943 -1.981648
N  4.067683 0.890195 -1.490694
H  3.921044 1.353557 -2.387975
H  3.261299 1.169503 -0.839832
C  2.90231 -0.837427 -2.717996
O  2.237458 0.070329 -3.160753
O  2.796296 -2.109001 -3.026338
H  2.030044 -2.235773 -3.636305
H  4.962003 1.165605 -1.094118
totalener: -1406.23226214 hartree
nucrepener: 1931.57680708 hartree
electener: -3337.80906922 hartree
oneelecener: -5746.03407770 hartree
twoeener: 2408.22500849 hartree
kineticenergy: 1400.63758533 hartree
exchangeener: -105.326367177842 hartree
correlationener: -7.059658334052 hartree
xcener: -112.386025511894 hartree
temp: 298.15 k
press: 1.00 atm
thermalcorrenthalpy: 0.00094421 hartree
totalenthalpy: -1405.98837428 hartree
totalentropycorr: -0.06490797 hartree
gibbsenthalpy: -1406.05328225 hartree
gibbsminuselec: 0.26280396 hartree
chargesum: 1.0000000
charge: -0.201180 0.200824 -0.200898 0.148854 0.378178 -0.344208 0.103800 0.051834 -0.280117 -0.184475 0.143998 -0.196797 0.181209 0.124037 0.158137 -0.191819 0.224150 0.145630 -0.123716 0.113680 0.252030 -0.386144 -0.166409 0.156653 0.144891 -0.248167 0.143594 0.127695 0.006402 0.167090 -0.063243 0.222125 0.227058 0.298916 -0.352179 -0.273921 0.273421 0.219067
charge: 0.320787 -0.005001 -0.070147 0.024921 -0.419604 0.156762 -0.405562 -0.137717 0.116773 0.341963 0.039829 -0.238046 -0.025398 0.008530 0.022034 0.421389 -0.085764 0.027361 0.511422 -0.140082 -0.337669 0.145016 0.000572 0.051408 0.035898 0.011469 0.046571 0.034523 -0.046913 0.043272 0.599400 0.037900 -0.065284 -0.459186 0.117704 0.404808 -0.119824 0.035882
qa: -0.2012 0.2008 -0.2009 0.1489 0.3782 -0.3442 0.1038 0.0518 -0.2801 -0.1845 0.1440 -0.1968 0.1812 0.1240 0.1581 -0.1918 0.2242 0.1456 -0.1237 0.1137 0.2520 -0.3861 -0.1664 0.1567 0.1449 -0.2482 0.1436 0.1277 0.0064 0.1671 -0.0632 0.2221 0.2271 0.2989 -0.3522 -0.2739 0.2734 0.2191
va: 3.0075 1.0186 3.8849 0.9852 4.2593 2.1316 4.4029 3.6649 2.2468 3.1042 1.0192 3.9577 1.0570 0.9970 0.9997 2.3134 1.0198 0.9919 2.1897 1.0210 4.1795 2.1229 3.7437 0.9982 1.0282 3.9524 1.0039 1.0076 3.8076 0.9984 3.5905 0.9979 1.0947 4.3185 2.1296 2.2858 1.0511 0.9831
dispcorr: -0.084416597 hartree
energy: -1406.321859643461
dipole: 6.19556 -3.82833 2.36723 1.43681 0.38485 1.82166 5.66150 -5.29404 0.36746
magnitude: 3.00953 au
magnitude: 7.64961 debye
zeropoint: 0.31021791 hartree
thermalvibcorrection: 0.01808277 hartree
thermalrotcorrection: 0.00141627 hartree
thermaltrasncorrection: 0.00141627 hartree
thermaltotal: -1405.99072643 hartree
thermalcorr: 0.02091531 hartree
nonthermalcorr: 0.31021791 hartree
totalcorr: 0.33113322 hartree
totalenthalpy: -1405.98978222 hartree
