program: Orca
programVersion: 5.0.2
elementType: N H C H C O C C O N H C H H H O H H S H C O C H H C H H C H N H H C O O H H
charge: 1
multiplicity: 1
keywords: wB97X-D3BJ Opt Freq def2-TZVPP def2/J RIJCOSX VeryTightSCF
keywords: PAL8 defgrid3 TightOpt
frequency: 0.00 0.00 0.00 0.00 0.00 0.00 24.19 40.06 46.54 52.56 59.89 65.11 78.82 85.16 99.39 112.54 140.99 180.81 206.95 219.93 223.49 234.80 281.59 299.04 302.66 319.99 332.74 346.27 401.70 420.54 438.63 478.90 491.58 503.31 524.10 538.32 575.64 598.26 598.73 610.30 644.25 656.15 676.30 694.05 723.10 732.40 757.05 762.95 784.37 829.99 864.27 874.30 885.19 919.65 938.89 997.57 1015.98 1032.25 1049.47 1055.20 1123.22 1151.61 1160.85 1180.89 1182.09 1193.93 1228.31 1252.04 1258.02 1279.99 1301.92 1305.99 1322.64 1341.12 1344.70 1354.91 1369.49 1389.07 1406.93 1440.41 1448.14 1457.63 1462.27 1477.80 1485.78 1488.70 1502.92 1514.22 1523.78 1542.34 1583.18 1680.99 1720.75 1786.67 1848.18 1855.90 2565.18 2746.99 3086.79 3095.75 3106.09 3111.18 3118.21 3118.28 3147.01 3160.66 3176.37 3192.19 3444.01 3557.74 3578.55 3638.92 3760.92 3800.55
frequency: 24.19 40.06 46.54 52.56 59.89 65.11 78.82 85.16 99.39 112.54 140.99 180.81 206.95 219.93 223.49 234.80 281.59 299.04 302.66 319.99 332.74 346.27 401.70 420.54 438.63 478.90 491.58 503.31 524.10 538.32 575.64 598.26 598.73 610.30 644.25 656.15 676.30 694.05 723.10 732.40 757.05 762.95 784.37 829.99 864.27 874.30 885.19 919.65 938.89 997.57 1015.98 1032.25 1049.47 1055.20 1123.22 1151.61 1160.85 1180.89 1182.09 1193.93 1228.31 1252.04 1258.02 1279.99 1301.92 1305.99 1322.64 1341.12 1344.70 1354.91 1369.49 1389.07 1406.93 1440.41 1448.14 1457.63 1462.27 1477.80 1485.78 1488.70 1502.92 1514.22 1523.78 1542.34 1583.18 1680.99 1720.75 1786.67 1848.18 1855.90 2565.18 2746.99 3086.79 3095.75 3106.09 3111.18 3118.21 3118.28 3147.01 3160.66 3176.37 3192.19 3444.01 3557.74 3578.55 3638.92 3760.92 3800.55
formula: C10H18N3O6S
InChI: InChI=1S/C10H18N3O6S/c11-5(10(18)19)1-2-7(14)13-6(4-20)9(17)12-3-8(15)16/h5-6,12-13,15,18,20H,1-4H2,11H3
38 atoms
N  -1.484827 -2.915529 -1.685795
H  -1.383803 -3.265265 -2.626315
C  -1.851409 -3.88324 -0.680531
H  -2.44606 -3.440235 0.120186
C  -0.650468 -4.561414 -0.034848
O  0.483633 -4.168346 -0.121598
C  -0.836073 -1.733853 -1.493683
C  -0.916213 -1.112103 -0.086943
O  -0.271434 -1.163252 -2.408117
N  -0.027106 0.019004 0.04768
H  -0.649786 -1.873353 0.649239
C  -2.353896 -0.640542 0.201725
H  -0.456866 0.926458 -0.090744
H  -3.05931 -1.450995 0.036315
H  -2.427484 -0.343314 1.2484
O  -1.029597 -5.629028 0.669249
H  -0.249388 -6.02206 1.083935
H  -2.48509 -4.644605 -1.134374
S  -2.866953 0.814241 -0.740966
H  -2.706116 0.288813 -1.962478
C  1.308846 0.018321 -0.007741
O  1.919462 1.099732 -0.016804
C  2.026828 -1.310585 -0.020496
H  1.922756 -1.750257 0.975672
H  1.524068 -1.998453 -0.694254
C  3.516999 -1.247683 -0.368974
H  3.868941 -2.275093 -0.460268
H  4.084091 -0.799409 0.450931
C  3.902046 -0.510412 -1.662531
H  4.853891 -0.896916 -2.031979
N  4.058578 0.95481 -1.412673
H  3.908759 1.45997 -2.290265
H  3.253121 1.20365 -0.742914
C  2.891762 -0.613284 -2.805264
O  2.544649 0.350328 -3.433871
O  2.486323 -1.858199 -3.003653
H  1.736272 -1.836231 -3.618403
H  4.961588 1.187741 -1.011089
totalener: -1406.24558108 hartree
nucrepener: 1919.12213072 hartree
electener: -3325.36771180 hartree
oneelecener: -5722.56470184 hartree
twoeener: 2397.19699004 hartree
kineticenergy: 1400.65791809 hartree
exchangeener: -105.328953167747 hartree
correlationener: -7.058565025115 hartree
xcener: -112.387518192861 hartree
temp: 298.15 k
press: 1.00 atm
thermalcorrenthalpy: 0.00094421 hartree
totalenthalpy: -1406.00045433 hartree
totalentropycorr: -0.06496540 hartree
gibbsenthalpy: -1406.06541973 hartree
gibbsminuselec: 0.26319675 hartree
chargesum: 1.0000000
charge: -0.176878 0.186394 -0.092888 0.115403 0.294264 -0.327232 0.128357 0.068310 -0.352789 -0.132463 0.116004 -0.176859 0.180463 0.122852 0.150924 -0.246335 0.244141 0.156465 -0.125809 0.119810 0.259095 -0.399066 -0.165249 0.140254 0.136690 -0.233364 0.134948 0.123730 -0.013784 0.150813 -0.068190 0.220809 0.226738 0.308829 -0.290450 -0.257126 0.259096 0.214091
charge: 0.329504 -0.008351 -0.052577 0.032679 -0.443852 0.112380 -0.395153 -0.137364 0.088088 0.358986 0.034949 -0.234042 -0.020989 0.004487 0.018270 0.385023 -0.076695 0.044692 0.520415 -0.140663 -0.330421 0.144016 -0.006658 0.045669 0.028132 0.006389 0.044462 0.033378 -0.050500 0.043930 0.597473 0.030631 -0.072401 -0.445780 0.147153 0.404722 -0.070658 0.030676
qa: -0.1769 0.1864 -0.0929 0.1154 0.2943 -0.3272 0.1284 0.0683 -0.3528 -0.1325 0.1160 -0.1769 0.1805 0.1229 0.1509 -0.2463 0.2441 0.1565 -0.1258 0.1198 0.2591 -0.3991 -0.1652 0.1403 0.1367 -0.2334 0.1349 0.1237 -0.0138 0.1508 -0.0682 0.2208 0.2267 0.3088 -0.2905 -0.2571 0.2591 0.2141
va: 3.1215 1.0172 3.8428 1.0115 4.2794 2.1373 4.3665 3.7582 2.1498 3.2143 1.0073 3.9470 1.0584 1.0120 0.9960 2.2497 1.0135 1.0051 2.1883 1.0239 4.2448 2.1162 3.7535 1.0044 1.0275 3.9441 1.0043 1.0061 3.8681 0.9986 3.5706 1.0103 1.0965 4.3539 2.2087 2.2701 1.0104 0.9856
dispcorr: -0.083131065 hartree
energy: -1406.334937163478
dipole: 5.81094 -3.42609 2.38485 -2.36535 1.43284 -0.93250 4.77786 -4.09961 0.67825
magnitude: 2.64898 au
magnitude: 6.73318 debye
zeropoint: 0.31028571 hartree
thermalvibcorrection: 0.01823471 hartree
thermalrotcorrection: 0.00141627 hartree
thermaltrasncorrection: 0.00141627 hartree
thermaltotal: -1406.00358420 hartree
thermalcorr: 0.02106725 hartree
nonthermalcorr: 0.31028571 hartree
totalcorr: 0.33135296 hartree
totalenthalpy: -1406.00263999 hartree
