program: Orca
programVersion: 5.0.2
elementType: N H C H C O C C O N H C H H H O H H S H C O C H H C H H C H N H H C O O H H
charge: 1
multiplicity: 1
keywords: wB97X-D3BJ Opt Freq def2-TZVPP def2/J RIJCOSX VeryTightSCF
keywords: PAL8 defgrid3 TightOpt
frequency: 0.00 0.00 0.00 0.00 0.00 0.00 11.86 27.16 39.35 49.80 62.43 70.79 74.96 76.34 96.19 98.71 142.41 158.17 179.51 199.11 207.21 243.50 263.26 277.50 302.63 303.42 313.95 350.18 365.71 381.00 430.24 467.84 502.00 508.42 514.40 535.37 578.10 597.14 603.06 633.80 652.83 663.46 668.20 697.47 737.66 752.64 762.28 777.74 788.50 840.30 843.08 872.98 888.50 912.56 952.18 993.07 1015.25 1030.15 1055.14 1107.00 1108.19 1137.07 1145.07 1163.83 1168.39 1195.80 1204.76 1216.90 1232.98 1272.19 1279.97 1292.94 1323.18 1329.35 1335.26 1348.17 1369.51 1381.02 1405.90 1432.59 1443.66 1452.36 1462.62 1467.11 1490.69 1502.10 1507.26 1511.53 1545.15 1551.32 1669.78 1678.01 1722.69 1806.72 1847.06 1858.73 2759.00 2947.42 3104.09 3107.06 3118.90 3129.51 3129.79 3132.12 3156.40 3178.95 3189.62 3203.04 3337.19 3553.70 3610.00 3635.01 3783.38 3797.97
frequency: 11.86 27.16 39.35 49.80 62.43 70.79 74.96 76.34 96.19 98.71 142.41 158.17 179.51 199.11 207.21 243.50 263.26 277.50 302.63 303.42 313.95 350.18 365.71 381.00 430.24 467.84 502.00 508.42 514.40 535.37 578.10 597.14 603.06 633.80 652.83 663.46 668.20 697.47 737.66 752.64 762.28 777.74 788.50 840.30 843.08 872.98 888.50 912.56 952.18 993.07 1015.25 1030.15 1055.14 1107.00 1108.19 1137.07 1145.07 1163.83 1168.39 1195.80 1204.76 1216.90 1232.98 1272.19 1279.97 1292.94 1323.18 1329.35 1335.26 1348.17 1369.51 1381.02 1405.90 1432.59 1443.66 1452.36 1462.62 1467.11 1490.69 1502.10 1507.26 1511.53 1545.15 1551.32 1669.78 1678.01 1722.69 1806.72 1847.06 1858.73 2759.00 2947.42 3104.09 3107.06 3118.90 3129.51 3129.79 3132.12 3156.40 3178.95 3189.62 3203.04 3337.19 3553.70 3610.00 3635.01 3783.38 3797.97
formula: C10H18N3O6S
InChI: InChI=1S/C10H18N3O6S/c11-5(10(18)19)1-2-7(14)13-6(4-20)9(17)12-3-8(15)16/h5-6,12-13,15,18,20H,1-4H2,11H3
38 atoms
N  -1.006596 -2.562542 1.617989
H  -0.76765 -3.457361 2.018759
C  -1.3377 -1.495729 2.534125
H  -1.948916 -0.733318 2.056473
C  -0.09033 -0.846001 3.117917
O  1.026134 -1.263159 2.968654
C  -0.713886 -2.444479 0.318636
C  -0.978129 -1.097842 -0.360973
O  -0.256254 -3.401174 -0.317129
N  -0.023379 -0.07285 0.049148
H  -1.951254 -0.756157 -0.002654
C  -1.103663 -1.270746 -1.874399
H  -0.37595 0.870741 -0.032833
H  -1.214718 -0.29451 -2.342917
H  -0.211333 -1.735296 -2.285403
O  -0.414201 0.233517 3.830682
H  0.393686 0.609367 4.207112
H  -1.931176 -1.899692 3.355862
S  -2.500014 -2.334679 -2.31746
H  -3.396428 -1.356828 -2.487608
C  1.360064 -0.059992 0.020482
O  1.946309 0.998403 -0.014339
C  2.143696 -1.360523 0.085212
H  1.59028 -2.143268 0.593908
H  3.006779 -1.132668 0.710544
C  2.617642 -1.785411 -1.308872
H  3.377515 -1.088471 -1.66245
H  1.805988 -1.758192 -2.037362
C  3.216643 -3.190619 -1.331112
H  3.662859 -3.38935 -2.306337
N  2.181532 -4.24717 -1.064695
H  2.534929 -4.815418 -0.280678
H  1.245446 -3.855167 -0.791765
C  4.292803 -3.396971 -0.267467
O  4.209457 -4.258011 0.570438
O  5.283542 -2.531531 -0.398765
H  5.946571 -2.69303 0.288549
H  2.039424 -4.853438 -1.86876
totalener: -1406.22879911 hartree
nucrepener: 1895.41965387 hartree
electener: -3301.64845298 hartree
oneelecener: -5674.52009005 hartree
twoeener: 2372.87163708 hartree
kineticenergy: 1400.65473166 hartree
exchangeener: -105.322385074460 hartree
correlationener: -7.053306533905 hartree
xcener: -112.375691608364 hartree
temp: 298.15 k
press: 1.00 atm
thermalcorrenthalpy: 0.00094421 hartree
totalenthalpy: -1405.98110726 hartree
totalentropycorr: -0.06601967 hartree
gibbsenthalpy: -1406.04712693 hartree
gibbsminuselec: 0.26335572 hartree
chargesum: 1.0000000
charge: -0.111082 0.193095 -0.071338 0.122280 0.288010 -0.319278 0.230683 0.024656 -0.442528 -0.223321 0.124033 -0.147053 0.186470 0.133920 0.079837 -0.252671 0.248673 0.156009 -0.136741 0.114922 0.140323 -0.294567 -0.138705 0.098096 0.149818 -0.221942 0.158168 0.125387 -0.013890 0.156657 -0.057925 0.220767 0.221500 0.303596 -0.296654 -0.235645 0.258088 0.228355
charge: 0.366439 0.002175 -0.034986 0.035674 -0.450359 0.121358 -0.356718 -0.160339 0.099720 0.316170 0.036836 -0.241525 -0.010662 0.011547 -0.006339 0.384542 -0.074148 0.044421 0.501123 -0.146529 -0.377052 0.118732 -0.011536 0.011612 0.045329 -0.000473 0.049200 0.024250 -0.044771 0.046106 0.611516 0.027853 -0.044356 -0.435197 0.143354 0.413598 -0.060380 0.043818
qa: -0.1111 0.1931 -0.0713 0.1223 0.2880 -0.3193 0.2307 0.0247 -0.4425 -0.2233 0.1240 -0.1471 0.1865 0.1339 0.0798 -0.2527 0.2487 0.1560 -0.1367 0.1149 0.1403 -0.2946 -0.1387 0.0981 0.1498 -0.2219 0.1582 0.1254 -0.0139 0.1567 -0.0579 0.2208 0.2215 0.3036 -0.2967 -0.2356 0.2581 0.2284
va: 3.2504 1.0153 3.8130 1.0186 4.3406 2.1723 4.2366 3.7939 2.0317 2.9965 1.0120 4.0063 1.0189 1.0041 1.0294 2.2418 1.0095 0.9975 2.1676 1.0205 4.3789 2.2317 3.6789 1.0520 1.0391 3.8449 1.0208 1.0041 3.8972 1.0007 3.5861 1.0231 1.0969 4.3095 2.1959 2.2909 1.0021 0.9775
dispcorr: -0.082543227 hartree
energy: -1406.315910507196
dipole: -0.63635 1.25041 0.61406 -0.94018 -0.71987 -1.66005 -5.20042 4.61746 -0.58297
magnitude: 1.86352 au
magnitude: 4.73668 debye
zeropoint: 0.31076371 hartree
thermalvibcorrection: 0.01862163 hartree
thermalrotcorrection: 0.00141627 hartree
thermaltrasncorrection: 0.00141627 hartree
thermaltotal: -1405.98369262 hartree
thermalcorr: 0.02145418 hartree
nonthermalcorr: 0.31076371 hartree
totalcorr: 0.33221789 hartree
totalenthalpy: -1405.98274841 hartree
