program: Orca
programVersion: 5.0.2
elementType: N H C H C O C C O N H C H H H O H H S H C O C H H C H H C H N H H C O O H H
charge: 1
multiplicity: 1
keywords: wB97X-D3BJ Opt Freq def2-TZVPP def2/J RIJCOSX VeryTightSCF
keywords: PAL8 defgrid3 TightOpt
frequency: 0.00 0.00 0.00 0.00 0.00 0.00 22.76 42.58 66.38 77.69 82.26 85.55 93.37 99.69 110.75 121.52 126.22 155.60 175.15 187.02 205.15 210.53 225.60 251.58 264.55 269.01 298.80 314.20 327.32 338.49 420.70 428.23 480.48 510.97 529.32 544.89 585.12 621.13 629.80 641.04 667.50 683.23 701.82 727.58 754.31 780.45 803.66 807.17 824.45 862.07 878.56 880.55 903.90 932.65 952.89 997.88 1000.01 1015.75 1033.47 1080.95 1092.45 1101.60 1141.57 1144.79 1175.34 1211.80 1216.18 1227.44 1271.22 1288.65 1298.27 1309.36 1312.49 1338.68 1354.18 1370.96 1378.21 1384.45 1408.38 1442.83 1447.66 1452.17 1473.35 1478.04 1487.51 1490.99 1506.55 1511.31 1511.93 1526.88 1653.98 1671.71 1770.19 1800.21 1809.00 1868.57 2754.21 3073.44 3098.41 3100.81 3113.91 3135.99 3137.02 3169.31 3175.06 3176.62 3214.53 3224.31 3425.59 3508.12 3533.37 3616.15 3621.62 3785.36
frequency: 22.76 42.58 66.38 77.69 82.26 85.55 93.37 99.69 110.75 121.52 126.22 155.60 175.15 187.02 205.15 210.53 225.60 251.58 264.55 269.01 298.80 314.20 327.32 338.49 420.70 428.23 480.48 510.97 529.32 544.89 585.12 621.13 629.80 641.04 667.50 683.23 701.82 727.58 754.31 780.45 803.66 807.17 824.45 862.07 878.56 880.55 903.90 932.65 952.89 997.88 1000.01 1015.75 1033.47 1080.95 1092.45 1101.60 1141.57 1144.79 1175.34 1211.80 1216.18 1227.44 1271.22 1288.65 1298.27 1309.36 1312.49 1338.68 1354.18 1370.96 1378.21 1384.45 1408.38 1442.83 1447.66 1452.17 1473.35 1478.04 1487.51 1490.99 1506.55 1511.31 1511.93 1526.88 1653.98 1671.71 1770.19 1800.21 1809.00 1868.57 2754.21 3073.44 3098.41 3100.81 3113.91 3135.99 3137.02 3169.31 3175.06 3176.62 3214.53 3224.31 3425.59 3508.12 3533.37 3616.15 3621.62 3785.36
formula: C10H18N3O6S
InChI: InChI=1S/C10H18N3O6S/c11-5(10(18)19)1-2-7(14)13-6(4-20)9(17)12-3-8(15)16/h5-6,12-13,15,18,20H,1-4H2,11H3
38 atoms
N  -0.618244 -3.510121 0.680887
H  -0.669138 -4.381642 0.172096
C  -0.877824 -3.57697 2.110958
H  -0.592173 -2.650467 2.596137
C  -0.011694 -4.676845 2.697672
O  1.028151 -4.514963 3.303822
C  -0.688324 -2.422672 -0.152895
C  -0.903066 -1.037141 0.463645
O  -0.59028 -2.558059 -1.352776
N  0.029534 -0.046995 -0.058887
H  -0.829911 -1.070554 1.549483
C  -2.318658 -0.584145 0.085629
H  -0.333563 0.893114 -0.122598
H  -2.513186 0.393921 0.528974
H  -2.394645 -0.493161 -0.996721
O  -0.507662 -5.883076 2.454274
H  0.085065 -6.553127 2.824515
H  -1.927919 -3.787926 2.325142
S  -3.613794 -1.681552 0.705764
H  -3.576662 -2.555852 -0.30651
C  1.386132 -0.065448 -0.045516
O  2.039799 0.964091 -0.107622
C  2.105722 -1.406102 -0.027785
H  1.553223 -2.176303 0.50481
H  2.175982 -1.744055 -1.063709
C  3.504627 -1.255111 0.56144
H  4.082566 -0.55253 -0.041108
H  4.000325 -2.23055 0.553069
C  3.451335 -0.7275 2.000624
H  3.200422 0.330703 2.019356
N  4.81371 -0.906704 2.63059
H  4.963647 -1.903576 2.812496
H  5.545863 -0.566555 2.005277
C  2.426245 -1.524117 2.797414
O  1.296969 -1.147305 2.940294
O  2.923756 -2.691362 3.18842
H  2.183655 -3.317149 3.419981
H  4.893254 -0.409452 3.518529
totalener: -1406.21211353 hartree
nucrepener: 1909.73521270 hartree
electener: -3315.94732623 hartree
oneelecener: -5704.05720348 hartree
twoeener: 2388.10987725 hartree
kineticenergy: 1400.62432506 hartree
exchangeener: -105.316660670590 hartree
correlationener: -7.054409973370 hartree
xcener: -112.371070643961 hartree
temp: 298.15 k
press: 1.00 atm
thermalcorrenthalpy: 0.00094421 hartree
totalenthalpy: -1405.96500484 hartree
totalentropycorr: -0.06582196 hartree
gibbsenthalpy: -1406.03082680 hartree
gibbsminuselec: 0.26376440 hartree
chargesum: 1.0000000
charge: -0.170987 0.188602 -0.085706 0.123372 0.342788 -0.360237 0.066382 0.075286 -0.290275 -0.149068 0.112599 -0.185635 0.169883 0.125611 0.158755 -0.232777 0.246526 0.151799 -0.150207 0.121938 0.190259 -0.363984 -0.145774 0.056235 0.146490 -0.214023 0.141894 0.123498 -0.003147 0.196947 -0.058027 0.242546 0.244118 0.286184 -0.284391 -0.333661 0.270505 0.245680
charge: 0.315133 -0.011508 -0.049269 0.023432 -0.396865 0.152767 -0.413493 -0.146508 0.111624 0.341066 0.015914 -0.234597 -0.008062 0.010624 0.018124 0.401067 -0.069241 0.026276 0.507398 -0.141879 -0.377356 0.075299 0.005009 0.021470 0.050859 -0.003926 0.037038 0.029237 -0.037710 0.048677 0.616873 0.054153 0.061589 -0.463756 0.156183 0.353949 -0.141008 0.061416
qa: -0.1710 0.1886 -0.0857 0.1234 0.3428 -0.3602 0.0664 0.0753 -0.2903 -0.1491 0.1126 -0.1856 0.1699 0.1256 0.1588 -0.2328 0.2465 0.1518 -0.1502 0.1219 0.1903 -0.3640 -0.1458 0.0562 0.1465 -0.2140 0.1419 0.1235 -0.0031 0.1969 -0.0580 0.2425 0.2441 0.2862 -0.2844 -0.3337 0.2705 0.2457
va: 2.9687 1.0220 3.8163 1.0232 4.2533 2.1126 4.4156 3.7223 2.2539 3.1450 1.0120 3.9584 1.0259 1.0005 1.0073 2.2741 1.0106 1.0142 2.1727 1.0193 4.3742 2.1546 3.8215 1.0548 1.0116 3.9425 1.0158 1.0044 3.7069 1.0140 3.6439 0.9889 0.9658 4.3212 2.2065 2.1658 1.0742 0.9663
dispcorr: -0.082855758 hartree
energy: -1406.300152127465
dipole: 10.07192 -5.14036 4.93156 2.61552 -3.05884 -0.44333 -0.02611 2.58195 2.55584
magnitude: 5.57218 au
magnitude: 14.16335 debye
zeropoint: 0.31125467 hartree
thermalvibcorrection: 0.01857493 hartree
thermalrotcorrection: 0.00141627 hartree
thermaltrasncorrection: 0.00141627 hartree
thermaltotal: -1405.96748999 hartree
thermalcorr: 0.02140747 hartree
nonthermalcorr: 0.31125467 hartree
totalcorr: 0.33266213 hartree
totalenthalpy: -1405.96654578 hartree
