program: Orca
programVersion: 5.0.2
elementType: N H C H C O C C O N H C H H H O H H S H C O C H H C H H C H N H H C O O H H
charge: 1
multiplicity: 1
keywords: wB97X-D3BJ Opt Freq def2-TZVPP def2/J RIJCOSX VeryTightSCF
keywords: PAL8 defgrid3 TightOpt
frequency: 0.00 0.00 0.00 0.00 0.00 0.00 20.68 31.95 43.91 49.12 52.79 59.56 71.69 84.08 88.80 113.50 138.20 153.27 184.76 193.54 213.42 214.56 226.24 227.83 251.89 300.80 318.86 328.79 335.23 376.64 418.88 445.72 499.88 508.32 522.69 553.95 559.90 578.65 597.06 619.56 652.25 656.23 692.41 707.76 725.79 734.96 749.21 764.87 792.60 839.42 849.43 882.88 884.91 920.85 972.76 979.93 998.77 1014.02 1034.69 1088.87 1102.71 1112.83 1135.72 1155.82 1165.68 1190.56 1199.34 1224.19 1239.10 1285.87 1294.99 1309.51 1318.80 1326.79 1339.74 1352.14 1359.12 1387.54 1407.54 1432.10 1448.18 1461.34 1466.95 1474.57 1482.69 1486.93 1488.36 1501.75 1507.06 1525.96 1640.62 1674.20 1773.74 1789.97 1841.51 1858.76 2756.53 3077.84 3088.96 3105.17 3112.95 3124.76 3127.96 3152.32 3163.30 3179.92 3262.36 3262.56 3496.00 3553.30 3610.63 3636.69 3758.92 3799.55
frequency: 20.68 31.95 43.91 49.12 52.79 59.56 71.69 84.08 88.80 113.50 138.20 153.27 184.76 193.54 213.42 214.56 226.24 227.83 251.89 300.80 318.86 328.79 335.23 376.64 418.88 445.72 499.88 508.32 522.69 553.95 559.90 578.65 597.06 619.56 652.25 656.23 692.41 707.76 725.79 734.96 749.21 764.87 792.60 839.42 849.43 882.88 884.91 920.85 972.76 979.93 998.77 1014.02 1034.69 1088.87 1102.71 1112.83 1135.72 1155.82 1165.68 1190.56 1199.34 1224.19 1239.10 1285.87 1294.99 1309.51 1318.80 1326.79 1339.74 1352.14 1359.12 1387.54 1407.54 1432.10 1448.18 1461.34 1466.95 1474.57 1482.69 1486.93 1488.36 1501.75 1507.06 1525.96 1640.62 1674.20 1773.74 1789.97 1841.51 1858.76 2756.53 3077.84 3088.96 3105.17 3112.95 3124.76 3127.96 3152.32 3163.30 3179.92 3262.36 3262.56 3496.00 3553.30 3610.63 3636.69 3758.92 3799.55
formula: C10H18N3O6S
InChI: InChI=1S/C10H18N3O6S/c11-5(10(18)19)1-2-7(14)13-6(4-20)9(17)12-3-8(15)16/h5-6,12-13,15,18,20H,1-4H2,11H3
38 atoms
N  -1.008711 -2.682408 1.122353
H  -1.056777 -3.674735 1.297156
C  -1.55653 -1.816449 2.139511
H  -1.365333 -2.250841 3.1201
C  -3.053522 -1.585101 1.98172
O  -3.675564 -1.807609 0.978801
C  -0.873755 -2.391895 -0.197331
C  -0.957824 -0.918369 -0.617648
O  -0.668773 -3.266908 -1.022449
N  0.027758 -0.05377 0.023876
H  -1.932311 -0.574648 -0.262076
C  -0.998092 -0.794393 -2.142117
H  -0.245837 0.917759 0.073513
H  -1.780506 -1.445584 -2.52676
H  -1.251652 0.229422 -2.410796
O  -3.575531 -1.065823 3.098817
H  -4.51729 -0.906232 2.947654
H  -1.062508 -0.843692 2.127153
S  0.540915 -1.234216 -2.991476
H  0.901867 0.004354 -3.343546
C  1.396983 -0.164685 0.053584
O  2.095442 0.820126 0.192369
C  2.024751 -1.545997 0.02378
H  2.1948 -1.84515 1.062227
H  1.369221 -2.276536 -0.425336
C  3.344283 -1.47762 -0.739636
H  4.073121 -0.902461 -0.163859
H  3.177219 -0.952747 -1.684062
C  3.925318 -2.858785 -1.0556
H  4.154984 -3.427757 -0.155458
N  5.190895 -2.668319 -1.854885
H  4.89289 -2.731389 -2.845656
H  5.622865 -1.763743 -1.669292
C  3.015412 -3.651862 -1.998443
O  3.218923 -3.652857 -3.187165
O  2.045864 -4.257382 -1.352118
H  1.347931 -4.561656 -1.953998
H  5.87767 -3.402901 -1.6879
totalener: -1406.20831710 hartree
nucrepener: 1924.39101032 hartree
electener: -3330.59932741 hartree
oneelecener: -5733.36096544 hartree
twoeener: 2402.76163802 hartree
kineticenergy: 1400.64398847 hartree
exchangeener: -105.317036562307 hartree
correlationener: -7.057777965912 hartree
xcener: -112.374814528218 hartree
temp: 298.15 k
press: 1.00 atm
thermalcorrenthalpy: 0.00094421 hartree
totalenthalpy: -1405.96413041 hartree
totalentropycorr: -0.06533061 hartree
gibbsenthalpy: -1406.02946102 hartree
gibbsminuselec: 0.26319878 hartree
chargesum: 1.0000000
charge: -0.182008 0.185983 -0.085007 0.147289 0.278371 -0.303246 0.222899 0.026497 -0.373973 -0.217934 0.138837 -0.160821 0.185403 0.142765 0.129641 -0.257451 0.244262 0.121572 -0.166975 0.113543 0.174783 -0.334840 -0.106062 0.123950 0.050887 -0.257322 0.133490 0.124436 0.044834 0.164965 -0.053736 0.239104 0.237185 0.277916 -0.293062 -0.232868 0.276421 0.240270
charge: 0.330697 -0.008741 -0.052249 0.039023 -0.448180 0.123448 -0.384538 -0.147163 0.075886 0.318524 0.043209 -0.224813 -0.012260 0.020165 0.010445 0.374326 -0.078906 0.031976 0.513268 -0.152849 -0.387634 0.094583 -0.010826 0.035876 0.007183 -0.015086 0.033291 0.030262 -0.035143 0.042344 0.617415 0.039721 0.053527 -0.453389 0.145358 0.430210 -0.054506 0.055546
qa: -0.1820 0.1860 -0.0850 0.1473 0.2784 -0.3032 0.2229 0.0265 -0.3740 -0.2179 0.1388 -0.1608 0.1854 0.1428 0.1296 -0.2575 0.2443 0.1216 -0.1670 0.1135 0.1748 -0.3348 -0.1061 0.1239 0.0509 -0.2573 0.1335 0.1244 0.0448 0.1650 -0.0537 0.2391 0.2372 0.2779 -0.2931 -0.2329 0.2764 0.2403
va: 3.1413 1.0174 3.8017 1.0062 4.3219 2.1836 4.2805 3.7917 2.1344 3.0350 1.0156 3.9692 1.0171 1.0124 1.0025 2.2328 1.0130 1.0278 2.2020 1.0179 4.3443 2.1864 3.7723 1.0172 1.1164 3.9632 1.0234 1.0276 3.7944 0.9991 3.6483 1.0167 0.9729 4.3552 2.1930 2.2952 0.9921 0.9720
dispcorr: -0.083329477 hartree
energy: -1406.300473668478
dipole: 10.15988 -5.64032 4.51956 2.32516 -3.32469 -0.99953 1.20586 -0.95839 0.24747
magnitude: 4.63538 au
magnitude: 11.78220 debye
zeropoint: 0.31065011 hartree
thermalvibcorrection: 0.01896004 hartree
thermalrotcorrection: 0.00141627 hartree
thermaltrasncorrection: 0.00141627 hartree
thermaltotal: -1405.96803098 hartree
thermalcorr: 0.02179258 hartree
nonthermalcorr: 0.31065011 hartree
totalcorr: 0.33244269 hartree
totalenthalpy: -1405.96708677 hartree
