program: Orca
programVersion: 5.0.2
elementType: N H C H C O C C O N H C H H H O H H S H C O C H H C H H C H N H H C O O H H
charge: 1
multiplicity: 1
keywords: wB97X-D3BJ Opt Freq def2-TZVPP def2/J RIJCOSX VeryTightSCF
keywords: PAL8 defgrid3 TightOpt
frequency: 0.00 0.00 0.00 0.00 0.00 0.00 24.44 30.08 39.71 50.10 56.71 59.84 66.36 82.70 103.45 113.50 116.70 167.64 191.32 216.39 230.13 264.11 276.63 283.34 289.59 309.10 326.21 335.76 380.35 423.38 464.28 483.30 498.25 508.03 534.52 556.87 577.80 589.00 617.10 645.98 665.02 682.69 696.70 724.85 730.63 734.81 745.15 782.82 823.45 828.18 846.09 884.48 901.17 918.76 957.94 978.26 996.94 1009.75 1063.70 1071.65 1096.21 1146.62 1155.17 1184.62 1197.04 1199.53 1214.52 1219.73 1248.71 1263.30 1283.04 1294.55 1331.75 1341.48 1344.05 1367.27 1375.73 1398.35 1406.41 1446.39 1451.86 1457.60 1465.99 1476.14 1488.88 1500.36 1508.65 1516.84 1522.80 1557.80 1591.09 1700.48 1719.86 1792.50 1845.34 1861.98 2394.77 2773.17 3084.87 3096.29 3098.91 3108.99 3111.17 3152.20 3164.48 3173.55 3188.10 3240.55 3477.21 3577.87 3607.03 3640.65 3780.53 3796.40
frequency: 24.44 30.08 39.71 50.10 56.71 59.84 66.36 82.70 103.45 113.50 116.70 167.64 191.32 216.39 230.13 264.11 276.63 283.34 289.59 309.10 326.21 335.76 380.35 423.38 464.28 483.30 498.25 508.03 534.52 556.87 577.80 589.00 617.10 645.98 665.02 682.69 696.70 724.85 730.63 734.81 745.15 782.82 823.45 828.18 846.09 884.48 901.17 918.76 957.94 978.26 996.94 1009.75 1063.70 1071.65 1096.21 1146.62 1155.17 1184.62 1197.04 1199.53 1214.52 1219.73 1248.71 1263.30 1283.04 1294.55 1331.75 1341.48 1344.05 1367.27 1375.73 1398.35 1406.41 1446.39 1451.86 1457.60 1465.99 1476.14 1488.88 1500.36 1508.65 1516.84 1522.80 1557.80 1591.09 1700.48 1719.86 1792.50 1845.34 1861.98 2394.77 2773.17 3084.87 3096.29 3098.91 3108.99 3111.17 3152.20 3164.48 3173.55 3188.10 3240.55 3477.21 3577.87 3607.03 3640.65 3780.53 3796.40
formula: C10H18N3O6S
InChI: InChI=1S/C10H18N3O6S/c11-5(10(18)19)1-2-7(14)13-6(4-20)9(17)12-3-8(15)16/h5-6,12-13,15,18,20H,1-4H2,11H3
38 atoms
N  -1.969256 -1.471689 2.436245
H  -1.801462 -1.789849 3.378484
C  -3.220021 -0.797337 2.181494
H  -3.688276 -1.138633 1.253579
C  -3.088392 0.718284 2.092921
O  -2.074025 1.301399 1.807539
C  -0.853282 -1.479402 1.665163
C  -0.964616 -0.980523 0.21765
O  0.208765 -1.9080 2.07565
N  0.024164 0.069745 -0.009701
H  -1.914528 -0.484518 0.04537
C  -0.915993 -2.165506 -0.749642
H  -0.343985 1.005286 0.101196
H  -0.030291 -2.779207 -0.61619
H  -1.769198 -2.809068 -0.526038
O  -4.257819 1.314574 2.325521
H  -4.145313 2.269219 2.217131
H  -3.918911 -1.046727 2.978023
S  -1.125442 -1.691773 -2.47866
H  -0.043327 -0.91225 -2.566969
C  1.357503 0.045992 -0.040068
O  1.975345 1.130728 -0.084974
C  2.17341 -1.226217 -0.054515
H  2.855246 -1.132063 0.794559
H  1.580511 -2.103069 0.166801
C  2.960546 -1.450385 -1.358321
H  2.29004 -1.772878 -2.154846
H  3.641987 -2.284265 -1.180127
C  3.778907 -0.273213 -1.905837
H  4.603564 -0.665976 -2.506282
N  4.351369 0.577207 -0.820328
H  3.464947 0.927537 -0.289394
H  4.995228 0.071811 -0.218718
C  3.066205 0.726525 -2.820571
O  3.448085 1.85902 -2.926609
O  2.059594 0.189878 -3.507529
H  1.719259 0.86167 -4.116682
H  4.813816 1.387607 -1.235524
totalener: -1406.23294570 hartree
nucrepener: 1871.16021096 hartree
electener: -3277.39315665 hartree
oneelecener: -5626.68929169 hartree
twoeener: 2349.29613504 hartree
kineticenergy: 1400.64484440 hartree
exchangeener: -105.323385232768 hartree
correlationener: -7.054980472670 hartree
xcener: -112.378365705437 hartree
temp: 298.15 k
press: 1.00 atm
thermalcorrenthalpy: 0.00094421 hartree
totalenthalpy: -1405.98564077 hartree
totalentropycorr: -0.06586787 hartree
gibbsenthalpy: -1406.05150865 hartree
gibbsminuselec: 0.26259672 hartree
chargesum: 1.0000000
charge: -0.179191 0.193882 -0.108355 0.129965 0.317063 -0.335211 0.225241 0.025835 -0.365506 -0.143878 0.106958 -0.171515 0.207247 0.124246 0.135192 -0.246755 0.245229 0.149697 -0.116610 0.081691 0.262852 -0.396527 -0.175411 0.137105 0.119268 -0.216295 0.126266 0.141972 -0.036161 0.153833 -0.075149 0.228561 0.212873 0.308293 -0.288501 -0.260761 0.253009 0.229547
charge: 0.333008 -0.005023 -0.051338 0.036240 -0.437441 0.111304 -0.375872 -0.136190 0.096807 0.366836 0.032354 -0.240972 0.005656 -0.001772 0.022424 0.385489 -0.075580 0.043837 0.495149 -0.168193 -0.329267 0.144276 -0.005383 0.040810 0.023054 0.001410 0.034754 0.036911 -0.053681 0.048185 0.592267 -0.065707 0.030739 -0.439506 0.144826 0.388523 -0.065848 0.036911
qa: -0.1792 0.1939 -0.1084 0.1300 0.3171 -0.3352 0.2252 0.0258 -0.3655 -0.1439 0.1070 -0.1715 0.2072 0.1242 0.1352 -0.2468 0.2452 0.1497 -0.1166 0.0817 0.2629 -0.3965 -0.1754 0.1371 0.1193 -0.2163 0.1263 0.1420 -0.0362 0.1538 -0.0751 0.2286 0.2129 0.3083 -0.2885 -0.2608 0.2530 0.2295
va: 3.1567 1.0113 3.8635 0.9970 4.2489 2.1449 4.3178 3.8635 2.1514 3.1907 1.0238 3.9810 1.0132 1.0003 1.0049 2.2531 1.0129 1.0061 2.1693 1.0443 4.1730 2.1228 3.8698 1.0137 1.0507 3.8060 1.0219 0.9993 3.8842 0.9983 3.5423 1.1005 0.9857 4.3465 2.2102 2.2301 1.0055 0.9971
dispcorr: -0.081777734 hartree
energy: -1406.319421148778
dipole: 7.02760 -5.04779 1.97981 -6.09446 5.90286 -0.19160 0.04269 -0.25191 -0.20922
magnitude: 2.00003 au
magnitude: 5.08368 debye
zeropoint: 0.31073090 hartree
thermalvibcorrection: 0.01832216 hartree
thermalrotcorrection: 0.00141627 hartree
thermaltrasncorrection: 0.00141627 hartree
thermaltotal: -1405.98753554 hartree
thermalcorr: 0.02115471 hartree
nonthermalcorr: 0.31073090 hartree
totalcorr: 0.33188561 hartree
totalenthalpy: -1405.98659133 hartree
