program: Orca
programVersion: 5.0.2
elementType: N H C H C O C C O N H C H H H O H H S H C O C H H C H H C H N H H C O O H H
charge: 1
multiplicity: 1
keywords: wB97X-D3BJ Opt Freq def2-TZVPP def2/J RIJCOSX VeryTightSCF
keywords: PAL8 defgrid3 TightOpt
frequency: 0.00 0.00 0.00 0.00 0.00 0.00 25.44 35.84 38.84 50.58 60.03 75.16 81.80 89.33 101.49 115.76 127.97 168.92 209.91 240.32 245.19 255.13 283.87 293.43 295.56 308.33 330.52 347.44 359.59 418.04 452.09 461.96 496.58 515.48 534.75 550.32 557.58 576.94 611.31 619.32 630.65 659.02 665.95 683.19 737.32 741.54 756.34 779.51 809.09 821.47 859.21 871.60 885.57 900.79 963.87 986.24 993.90 1056.75 1058.90 1091.08 1108.27 1142.43 1153.29 1169.65 1179.70 1196.03 1199.40 1222.71 1242.40 1274.76 1276.41 1299.84 1329.16 1334.12 1354.70 1362.64 1372.21 1391.50 1406.16 1426.45 1433.48 1438.67 1460.00 1482.05 1488.51 1494.86 1496.52 1501.08 1537.60 1541.40 1619.63 1707.18 1719.17 1780.94 1867.69 1883.51 2489.38 2748.17 3087.17 3099.72 3104.00 3112.24 3115.74 3136.71 3157.99 3162.48 3177.77 3181.53 3502.13 3571.79 3615.49 3644.85 3797.59 3798.58
frequency: 25.44 35.84 38.84 50.58 60.03 75.16 81.80 89.33 101.49 115.76 127.97 168.92 209.91 240.32 245.19 255.13 283.87 293.43 295.56 308.33 330.52 347.44 359.59 418.04 452.09 461.96 496.58 515.48 534.75 550.32 557.58 576.94 611.31 619.32 630.65 659.02 665.95 683.19 737.32 741.54 756.34 779.51 809.09 821.47 859.21 871.60 885.57 900.79 963.87 986.24 993.90 1056.75 1058.90 1091.08 1108.27 1142.43 1153.29 1169.65 1179.70 1196.03 1199.40 1222.71 1242.40 1274.76 1276.41 1299.84 1329.16 1334.12 1354.70 1362.64 1372.21 1391.50 1406.16 1426.45 1433.48 1438.67 1460.00 1482.05 1488.51 1494.86 1496.52 1501.08 1537.60 1541.40 1619.63 1707.18 1719.17 1780.94 1867.69 1883.51 2489.38 2748.17 3087.17 3099.72 3104.00 3112.24 3115.74 3136.71 3157.99 3162.48 3177.77 3181.53 3502.13 3571.79 3615.49 3644.85 3797.59 3798.58
formula: C10H18N3O6S
InChI: InChI=1S/C10H18N3O6S/c11-5(10(18)19)1-2-7(14)13-6(4-20)9(17)12-3-8(15)16/h5-6,12-13,15,18,20H,1-4H2,11H3
38 atoms
N  -1.15943 -1.463845 -2.559984
H  -1.033222 -2.106637 -3.326285
C  -1.67852 -0.161926 -2.87701
H  -1.372148 0.580835 -2.144083
C  -3.194326 -0.132277 -3.009647
O  -3.920087 -1.077385 -2.876997
C  -0.738796 -1.97102 -1.376384
C  -0.90825 -1.168731 -0.070585
O  -0.190394 -3.057193 -1.319718
N  -0.032644 0.009724 -0.040278
H  -0.586885 -1.867592 0.699943
C  -2.34112 -0.758887 0.270176
H  -0.458641 0.925234 -0.003889
H  -2.336049 -0.301542 1.26155
H  -2.741532 -0.018096 -0.420639
O  -3.611866 1.108496 -3.30106
H  -4.57384 1.087198 -3.39857
H  -1.252961 0.176673 -3.823781
S  -3.453204 -2.173395 0.380971
H  -3.650332 -2.316628 -0.935648
C  1.299323 0.015795 -0.026096
O  1.925372 1.095498 -0.01638
C  2.075978 -1.28269 -0.021548
H  2.778151 -1.199524 0.812401
H  1.446313 -2.148078 0.16713
C  2.829288 -1.547513 -1.339614
H  2.130067 -1.915194 -2.089916
H  3.545027 -2.351336 -1.159417
C  3.561641 -0.35714 -1.95563
H  4.320972 -0.711889 -2.656495
N  4.246039 0.473587 -0.909931
H  3.427156 0.862348 -0.316481
H  4.884868 -0.082112 -0.346102
C  2.638804 0.568869 -2.75442
O  1.562679 0.254693 -3.169144
O  3.232389 1.751997 -2.966685
H  2.645762 2.31498 -3.490763
H  4.756059 1.248246 -1.331189
totalener: -1406.22518116 hartree
nucrepener: 1900.58522350 hartree
electener: -3306.81040466 hartree
oneelecener: -5685.43660814 hartree
twoeener: 2378.62620347 hartree
kineticenergy: 1400.63010775 hartree
exchangeener: -105.317380476577 hartree
correlationener: -7.054934040853 hartree
xcener: -112.372314517430 hartree
temp: 298.15 k
press: 1.00 atm
thermalcorrenthalpy: 0.00094421 hartree
totalenthalpy: -1405.97978492 hartree
totalentropycorr: -0.06560936 hartree
gibbsenthalpy: -1406.04539428 hartree
gibbsminuselec: 0.26251728 hartree
chargesum: 1.0000000
charge: -0.122122 0.191694 -0.106506 0.100867 0.292136 -0.296421 0.113393 0.032377 -0.328429 -0.141390 0.150274 -0.214770 0.186549 0.149986 0.107915 -0.267123 0.246244 0.146711 -0.119830 0.138242 0.267137 -0.402485 -0.211814 0.141256 0.134417 -0.210421 0.142056 0.144983 -0.032063 0.164383 -0.072393 0.229633 0.218624 0.295845 -0.274827 -0.278835 0.253744 0.230965
charge: 0.343273 -0.003315 -0.064630 0.025391 -0.455476 0.131391 -0.401067 -0.136692 0.094264 0.363161 0.042039 -0.252280 -0.003029 0.016037 -0.000102 0.368043 -0.078420 0.040478 0.519683 -0.143285 -0.334788 0.125997 0.005638 0.034006 0.036655 0.010828 0.045666 0.037416 -0.052366 0.047934 0.593478 -0.056362 0.037584 -0.435145 0.156687 0.373318 -0.068317 0.036306
qa: -0.1221 0.1917 -0.1065 0.1009 0.2921 -0.2964 0.1134 0.0324 -0.3284 -0.1414 0.1503 -0.2148 0.1865 0.1500 0.1079 -0.2671 0.2462 0.1467 -0.1198 0.1382 0.2671 -0.4025 -0.2118 0.1413 0.1344 -0.2104 0.1421 0.1450 -0.0321 0.1644 -0.0724 0.2296 0.2186 0.2958 -0.2748 -0.2788 0.2537 0.2310
va: 3.0892 1.0171 3.8288 1.0249 4.3282 2.1879 4.3259 3.6840 2.1741 3.1976 1.0147 4.0310 1.0196 0.9933 0.9994 2.2159 1.0115 1.0117 2.1583 1.0316 4.1571 2.1121 3.8420 1.0080 1.0540 3.8247 1.0286 1.0007 3.8407 1.0000 3.5380 1.0939 0.9817 4.3610 2.2048 2.2188 1.0098 0.9878
dispcorr: -0.083839169 hartree
energy: -1406.313572080679
dipole: 12.90917 -7.93426 4.97490 2.16582 0.24623 2.41205 2.64958 -2.86302 -0.21344
magnitude: 5.53292 au
magnitude: 14.06356 debye
zeropoint: 0.31047844 hartree
thermalvibcorrection: 0.01822787 hartree
thermalrotcorrection: 0.00141627 hartree
thermaltrasncorrection: 0.00141627 hartree
thermaltotal: -1405.98203323 hartree
thermalcorr: 0.02106041 hartree
nonthermalcorr: 0.31047844 hartree
totalcorr: 0.33153885 hartree
totalenthalpy: -1405.98108902 hartree
