program: Orca
programVersion: 5.0.2
elementType: N H C H C O C C O N H C H H H O H H S H C O C H H C H H C H N H H C O O H H
charge: 1
multiplicity: 1
keywords: wB97X-D3BJ Opt Freq def2-TZVPP def2/J RIJCOSX VeryTightSCF
keywords: PAL8 defgrid3 TightOpt
frequency: 0.00 0.00 0.00 0.00 0.00 0.00 17.07 26.40 30.62 38.66 41.90 49.99 60.64 71.43 79.82 94.37 111.83 156.06 166.76 206.77 223.42 226.94 262.93 274.51 288.19 305.33 335.10 374.34 381.07 417.06 428.62 446.82 496.70 515.57 522.04 535.42 575.09 606.34 613.06 629.54 653.89 656.45 679.93 698.44 733.85 739.59 767.87 810.10 819.50 845.35 854.56 875.66 891.38 922.66 948.88 988.72 1012.85 1043.49 1070.74 1077.91 1119.05 1140.30 1162.97 1167.21 1172.88 1202.91 1205.44 1212.19 1257.87 1278.56 1298.00 1308.09 1310.22 1323.97 1352.48 1365.83 1374.48 1379.38 1399.21 1423.54 1427.72 1432.45 1464.66 1472.80 1475.94 1481.96 1489.65 1495.30 1542.09 1556.13 1639.03 1670.07 1711.80 1783.36 1876.01 1890.93 2152.52 2757.70 3074.05 3082.19 3089.22 3104.44 3110.34 3144.83 3151.81 3154.24 3166.42 3207.40 3510.62 3536.17 3573.23 3628.03 3784.21 3798.06
frequency: 17.07 26.40 30.62 38.66 41.90 49.99 60.64 71.43 79.82 94.37 111.83 156.06 166.76 206.77 223.42 226.94 262.93 274.51 288.19 305.33 335.10 374.34 381.07 417.06 428.62 446.82 496.70 515.57 522.04 535.42 575.09 606.34 613.06 629.54 653.89 656.45 679.93 698.44 733.85 739.59 767.87 810.10 819.50 845.35 854.56 875.66 891.38 922.66 948.88 988.72 1012.85 1043.49 1070.74 1077.91 1119.05 1140.30 1162.97 1167.21 1172.88 1202.91 1205.44 1212.19 1257.87 1278.56 1298.00 1308.09 1310.22 1323.97 1352.48 1365.83 1374.48 1379.38 1399.21 1423.54 1427.72 1432.45 1464.66 1472.80 1475.94 1481.96 1489.65 1495.30 1542.09 1556.13 1639.03 1670.07 1711.80 1783.36 1876.01 1890.93 2152.52 2757.70 3074.05 3082.19 3089.22 3104.44 3110.34 3144.83 3151.81 3154.24 3166.42 3207.40 3510.62 3536.17 3573.23 3628.03 3784.21 3798.06
formula: C10H18N3O6S
InChI: InChI=1S/C10H18N3O6S/c11-5(10(18)19)1-2-7(14)13-6(4-20)9(17)12-3-8(15)16/h5-6,12-13,15,18,20H,1-4H2,11H3
38 atoms
N  -3.146944 -1.23562 -1.1440
H  -4.01658 -0.761897 -1.341567
C  -3.017639 -2.592018 -1.625222
H  -3.12351 -2.615825 -2.713529
C  -4.039415 -3.576064 -1.075203
O  -3.958843 -4.756428 -1.255465
C  -2.297743 -0.487319 -0.41268
C  -0.959457 -1.07582 0.067312
O  -2.555545 0.66078 -0.091768
N  -0.019846 0.037504 -0.007281
H  -0.620983 -1.891282 -0.566824
C  -1.101734 -1.554795 1.520063
H  -0.465953 0.948493 0.057447
H  -0.124314 -1.862122 1.893596
H  -1.446194 -0.726483 2.138527
O  -5.050543 -2.976745 -0.420671
H  -5.67548 -3.667712 -0.161106
H  -2.043266 -3.005569 -1.387991
S  -2.174451 -2.99084 1.72775
H  -3.339197 -2.336814 1.651936
C  1.305004 0.018159 -0.051322
O  1.931928 1.099347 -0.059807
C  2.032622 -1.312113 -0.065868
H  2.124535 -1.64216 0.974119
H  1.419304 -2.062616 -0.563576
C  3.413375 -1.30814 -0.733161
H  3.349986 -0.891217 -1.742964
H  3.730317 -2.345143 -0.842885
C  4.533325 -0.603596 0.039984
H  4.430174 -0.813543 1.10744
N  4.442892 0.875908 -0.122097
H  4.804317 1.164487 -1.029082
H  3.358745 1.104209 -0.067493
C  5.902763 -1.144302 -0.371169
O  6.146074 -2.311215 -0.424153
O  6.77438 -0.157527 -0.639885
H  7.626524 -0.553752 -0.87327
H  4.979005 1.373542 0.584201
totalener: -1406.23437993 hartree
nucrepener: 1740.23479953 hartree
electener: -3146.46917945 hartree
oneelecener: -5364.63580975 hartree
twoeener: 2218.16663029 hartree
kineticenergy: 1400.62151072 hartree
exchangeener: -105.315869326417 hartree
correlationener: -7.050608480369 hartree
xcener: -112.366477806785 hartree
temp: 298.15 k
press: 1.00 atm
thermalcorrenthalpy: 0.00094421 hartree
totalenthalpy: -1405.98403173 hartree
totalentropycorr: -0.06689839 hartree
gibbsenthalpy: -1406.05093012 hartree
gibbsminuselec: 0.26009429 hartree
chargesum: 1.0000000
charge: -0.155341 0.203171 -0.117559 0.146282 0.287838 -0.277091 0.198404 0.026137 -0.358271 -0.133052 0.090868 -0.175290 0.209972 0.110583 0.144790 -0.282241 0.244799 0.121907 -0.128000 0.126736 0.280833 -0.395547 -0.179154 0.114575 0.133281 -0.225826 0.121525 0.153128 0.002024 0.136052 -0.078418 0.212414 0.218544 0.275200 -0.248704 -0.284704 0.256759 0.223373
charge: 0.341644 0.000928 -0.052580 0.038554 -0.458702 0.137021 -0.389980 -0.129741 0.090574 0.377014 0.016297 -0.246837 0.005101 0.004341 0.017551 0.353776 -0.080442 0.027117 0.525217 -0.141003 -0.324482 0.170415 -0.002931 0.040219 0.036675 0.007599 0.035846 0.047675 -0.058946 0.048836 0.579584 0.033959 -0.108371 -0.435236 0.166928 0.359008 -0.066109 0.033479
qa: -0.1553 0.2032 -0.1176 0.1463 0.2878 -0.2771 0.1984 0.0261 -0.3583 -0.1331 0.0909 -0.1753 0.2100 0.1106 0.1448 -0.2822 0.2448 0.1219 -0.1280 0.1267 0.2808 -0.3955 -0.1792 0.1146 0.1333 -0.2258 0.1215 0.1531 0.0020 0.1361 -0.0784 0.2124 0.2185 0.2752 -0.2487 -0.2847 0.2568 0.2234
va: 3.1578 1.0084 3.8343 0.9971 4.3539 2.2348 4.3407 3.8556 2.1641 3.2674 1.0207 3.9667 1.0330 1.0012 1.0082 2.1767 1.0141 1.0187 2.1985 1.0270 4.1776 2.1240 3.8048 1.0074 1.0036 3.9807 1.0053 1.0157 3.8004 1.0038 3.5208 0.9982 1.1198 4.3868 2.2510 2.2081 1.0060 0.9844
dispcorr: -0.077789845 hartree
energy: -1406.316566099927
dipole: 9.47533 -5.15458 4.32075 3.75411 -1.85494 1.89917 -0.37651 0.02519 -0.35131
magnitude: 4.73277 au
magnitude: 12.02975 debye
zeropoint: 0.30890170 hartree
thermalvibcorrection: 0.01878364 hartree
thermalrotcorrection: 0.00141627 hartree
thermaltrasncorrection: 0.00141627 hartree
thermaltotal: -1405.98604821 hartree
thermalcorr: 0.02161618 hartree
nonthermalcorr: 0.30890170 hartree
totalcorr: 0.33051789 hartree
totalenthalpy: -1405.98510400 hartree
