program: Orca
programVersion: 5.0.2
elementType: N H C H C O C C O N H C H H H O H H S H C O C H H C H H C H N H H C O O H H
charge: 1
multiplicity: 1
keywords: wB97X-D3BJ Opt Freq def2-TZVPP def2/J RIJCOSX VeryTightSCF
keywords: PAL8 defgrid3 TightOpt
frequency: 0.00 0.00 0.00 0.00 0.00 0.00 27.77 34.44 40.58 51.41 53.00 72.65 78.23 87.02 102.54 106.27 126.69 170.32 183.92 205.63 215.44 246.61 255.38 269.96 291.15 303.91 313.02 326.93 350.28 371.18 448.77 457.11 484.95 505.67 524.66 538.67 553.97 573.93 614.84 620.45 645.78 657.68 689.64 709.86 726.99 746.25 757.71 782.91 816.44 819.80 832.01 856.70 891.20 917.87 940.12 993.53 1008.34 1044.30 1054.03 1090.76 1109.72 1123.29 1152.17 1154.87 1185.56 1201.44 1206.08 1221.30 1226.11 1277.42 1288.73 1298.61 1327.16 1332.74 1339.40 1361.31 1366.16 1369.89 1400.58 1417.29 1439.27 1443.69 1452.71 1484.87 1489.96 1497.30 1498.93 1508.04 1532.09 1574.17 1666.74 1680.87 1720.52 1812.01 1855.77 1902.08 2753.32 2844.23 3096.37 3109.15 3122.54 3125.77 3135.22 3143.61 3147.71 3164.33 3175.48 3196.90 3490.18 3551.06 3623.97 3629.14 3781.98 3786.26
frequency: 27.77 34.44 40.58 51.41 53.00 72.65 78.23 87.02 102.54 106.27 126.69 170.32 183.92 205.63 215.44 246.61 255.38 269.96 291.15 303.91 313.02 326.93 350.28 371.18 448.77 457.11 484.95 505.67 524.66 538.67 553.97 573.93 614.84 620.45 645.78 657.68 689.64 709.86 726.99 746.25 757.71 782.91 816.44 819.80 832.01 856.70 891.20 917.87 940.12 993.53 1008.34 1044.30 1054.03 1090.76 1109.72 1123.29 1152.17 1154.87 1185.56 1201.44 1206.08 1221.30 1226.11 1277.42 1288.73 1298.61 1327.16 1332.74 1339.40 1361.31 1366.16 1369.89 1400.58 1417.29 1439.27 1443.69 1452.71 1484.87 1489.96 1497.30 1498.93 1508.04 1532.09 1574.17 1666.74 1680.87 1720.52 1812.01 1855.77 1902.08 2753.32 2844.23 3096.37 3109.15 3122.54 3125.77 3135.22 3143.61 3147.71 3164.33 3175.48 3196.90 3490.18 3551.06 3623.97 3629.14 3781.98 3786.26
formula: C10H18N3O6S
InChI: InChI=1S/C10H18N3O6S/c11-5(10(18)19)1-2-7(14)13-6(4-20)9(17)12-3-8(15)16/h5-6,12-13,15,18,20H,1-4H2,11H3
38 atoms
N  -1.334178 -0.777036 -2.635688
H  -1.22423 -1.196059 -3.547947
C  -1.346919 0.671299 -2.603088
H  -1.875074 1.03465 -3.486085
C  0.071544 1.230452 -2.628894
O  1.022572 0.611328 -3.023968
C  -0.951399 -1.594854 -1.639648
C  -0.950873 -1.105593 -0.182483
O  -0.617101 -2.757493 -1.894669
N  -0.021856 -0.015124 0.038798
H  -0.641178 -1.978565 0.38929
C  -2.350293 -0.740127 0.322322
H  -0.384726 0.922014 0.131085
H  -2.272954 -0.522584 1.388397
H  -2.748456 0.152186 -0.157703
O  0.108708 2.475068 -2.158534
H  1.028881 2.777392 -2.151673
H  -1.885174 1.057331 -1.742923
S  -3.530753 -2.097006 0.177447
H  -3.735445 -1.998143 -1.141391
C  1.352228 -0.075069 0.073401
O  2.015056 0.935416 0.134313
C  2.004271 -1.44855 0.018501
H  2.858137 -1.406421 0.695452
H  1.322949 -2.214732 0.391923
C  2.479053 -1.759541 -1.407878
H  3.368124 -1.170661 -1.631594
H  1.732581 -1.477343 -2.149089
C  2.835654 -3.230317 -1.619456
H  3.162322 -3.372132 -2.649374
N  1.63105 -4.113907 -1.404635
H  1.630709 -4.476101 -0.45091
H  0.727984 -3.589514 -1.569239
C  3.992943 -3.647823 -0.717938
O  5.080016 -3.169858 -0.809812
O  3.629634 -4.577148 0.190575
H  4.396604 -4.787388 0.742631
H  1.650582 -4.921627 -2.024074
totalener: -1406.22217342 hartree
nucrepener: 1910.60080615 hartree
electener: -3316.82297957 hartree
oneelecener: -5704.10963868 hartree
twoeener: 2387.28665911 hartree
kineticenergy: 1400.64121391 hartree
exchangeener: -105.317751329143 hartree
correlationener: -7.054593829365 hartree
xcener: -112.372345158508 hartree
temp: 298.15 k
press: 1.00 atm
thermalcorrenthalpy: 0.00094421 hartree
totalenthalpy: -1405.97698982 hartree
totalentropycorr: -0.06569371 hartree
gibbsenthalpy: -1406.04268353 hartree
gibbsminuselec: 0.26352758 hartree
chargesum: 1.0000000
charge: -0.108655 0.195351 -0.108635 0.151102 0.308532 -0.315440 0.136248 0.071367 -0.405155 -0.202969 0.111775 -0.182702 0.184241 0.150598 0.124897 -0.253311 0.259717 0.121611 -0.109610 0.108588 0.162317 -0.311617 -0.156715 0.155895 0.074504 -0.206689 0.164865 0.117829 -0.007816 0.164268 -0.060289 0.217333 0.221873 0.263230 -0.229025 -0.293421 0.254392 0.231516
charge: 0.350856 0.002111 -0.038260 0.045293 -0.458524 0.122563 -0.354347 -0.159371 0.114119 0.327651 0.031911 -0.241124 -0.015002 0.021406 -0.000361 0.387582 -0.068196 0.024996 0.515071 -0.147667 -0.378950 0.113157 -0.004421 0.044181 0.010223 0.003740 0.053684 0.025000 -0.043050 0.051076 0.604814 0.029209 -0.048324 -0.435618 0.179532 0.354718 -0.066607 0.046928
qa: -0.1087 0.1954 -0.1086 0.1511 0.3085 -0.3154 0.1362 0.0714 -0.4052 -0.2030 0.1118 -0.1827 0.1842 0.1506 0.1249 -0.2533 0.2597 0.1216 -0.1096 0.1086 0.1623 -0.3116 -0.1567 0.1559 0.0745 -0.2067 0.1649 0.1178 -0.0078 0.1643 -0.0603 0.2173 0.2219 0.2632 -0.2290 -0.2934 0.2544 0.2315
va: 3.1437 1.0143 3.8583 0.9972 4.2965 2.1777 4.2623 3.7490 2.0737 3.0251 1.0293 3.9786 1.0255 1.0000 1.0053 2.2477 1.0021 1.0222 2.1697 1.0274 4.3684 2.2131 3.7609 1.0296 1.0158 3.8675 1.0191 1.0456 3.8047 0.9946 3.5662 1.0043 1.0989 4.3594 2.2777 2.1746 1.0082 0.9761
dispcorr: -0.083959289 hartree
energy: -1406.311937568356
dipole: -2.04512 1.81407 -0.23104 -3.12620 0.71808 -2.40812 -0.58849 -0.05943 -0.64793
magnitude: 2.50444 au
magnitude: 6.36578 debye
zeropoint: 0.31070866 hartree
thermalvibcorrection: 0.01861729 hartree
thermalrotcorrection: 0.00141627 hartree
thermaltrasncorrection: 0.00141627 hartree
thermaltotal: -1405.97977908 hartree
thermalcorr: 0.02144983 hartree
nonthermalcorr: 0.31070866 hartree
totalcorr: 0.33215849 hartree
totalenthalpy: -1405.97883487 hartree
