program: Orca
programVersion: 5.0.2
elementType: N H C H C O C C O N H C H H H O H H S H C O C H H C H H C H N H H C O O H H
charge: 1
multiplicity: 1
keywords: wB97X-D3BJ Opt Freq def2-TZVPP def2/J RIJCOSX VeryTightSCF
keywords: PAL8 defgrid3 TightOpt
frequency: 0.00 0.00 0.00 0.00 0.00 0.00 22.13 27.64 31.48 40.63 43.80 53.17 62.33 68.59 87.81 110.56 134.50 159.94 180.76 211.74 220.42 240.59 245.91 256.85 288.38 299.33 306.45 315.09 328.95 362.20 420.57 429.39 492.83 502.34 518.23 529.46 583.93 585.61 590.44 618.69 638.21 652.48 659.38 680.28 732.28 742.58 754.25 772.86 800.75 821.80 828.77 879.57 885.70 908.70 948.37 974.54 991.03 1021.37 1029.70 1070.48 1094.93 1100.56 1141.85 1162.61 1167.19 1178.70 1184.34 1227.45 1247.30 1270.94 1284.78 1299.18 1317.72 1325.09 1335.46 1362.42 1371.07 1385.96 1412.07 1431.54 1439.58 1449.57 1461.14 1471.38 1484.12 1490.63 1502.90 1505.33 1518.69 1528.22 1664.00 1669.63 1742.73 1783.18 1869.85 1876.65 2769.38 3070.33 3099.48 3109.86 3119.53 3128.16 3132.92 3162.15 3169.94 3171.72 3199.97 3431.62 3514.08 3530.97 3635.32 3643.54 3790.78 3801.03
frequency: 22.13 27.64 31.48 40.63 43.80 53.17 62.33 68.59 87.81 110.56 134.50 159.94 180.76 211.74 220.42 240.59 245.91 256.85 288.38 299.33 306.45 315.09 328.95 362.20 420.57 429.39 492.83 502.34 518.23 529.46 583.93 585.61 590.44 618.69 638.21 652.48 659.38 680.28 732.28 742.58 754.25 772.86 800.75 821.80 828.77 879.57 885.70 908.70 948.37 974.54 991.03 1021.37 1029.70 1070.48 1094.93 1100.56 1141.85 1162.61 1167.19 1178.70 1184.34 1227.45 1247.30 1270.94 1284.78 1299.18 1317.72 1325.09 1335.46 1362.42 1371.07 1385.96 1412.07 1431.54 1439.58 1449.57 1461.14 1471.38 1484.12 1490.63 1502.90 1505.33 1518.69 1528.22 1664.00 1669.63 1742.73 1783.18 1869.85 1876.65 2769.38 3070.33 3099.48 3109.86 3119.53 3128.16 3132.92 3162.15 3169.94 3171.72 3199.97 3431.62 3514.08 3530.97 3635.32 3643.54 3790.78 3801.03
formula: C10H18N3O6S
InChI: InChI=1S/C10H18N3O6S/c11-5(10(18)19)1-2-7(14)13-6(4-20)9(17)12-3-8(15)16/h5-6,12-13,15,18,20H,1-4H2,11H3
38 atoms
N  -0.710551 -1.565219 2.505517
H  -0.578726 -2.227549 3.254071
C  -1.411621 -0.348348 2.825722
H  -1.168232 -0.056983 3.847407
C  -2.923954 -0.477565 2.704507
O  -3.496268 -1.433137 2.262443
C  -0.574391 -2.133082 1.277139
C  -0.933487 -1.273029 0.050687
O  -0.123917 -3.257463 1.15377
N  -0.045629 -0.111047 -0.053626
H  -1.933792 -0.873476 0.218993
C  -0.987049 -2.10262 -1.230492
H  -0.477318 0.791958 -0.179484
H  -1.116435 -1.421439 -2.072441
H  -0.064464 -2.658147 -1.385233
O  -3.528115 0.637601 3.142545
H  -4.482615 0.51876 3.04369
H  -1.076647 0.476865 2.197144
S  -2.399366 -3.223513 -1.284939
H  -1.95419 -4.070181 -0.351048
C  1.301159 -0.053623 -0.02651
O  1.890404 1.023929 -0.051541
C  2.123961 -1.327753 0.042344
H  1.537499 -2.237286 -0.036399
H  2.796475 -1.279427 -0.816995
C  2.945951 -1.397211 1.33541
H  3.643657 -2.234661 1.238788
H  2.29075 -1.604779 2.184609
C  3.72479 -0.119735 1.610516
H  4.179553 0.304857 0.718123
N  4.875031 -0.42367 2.567481
H  4.524592 -0.838391 3.433798
H  5.530216 -1.083156 2.146259
C  2.906671 0.965837 2.320675
O  1.8973 0.755789 2.927766
O  3.567074 2.127154 2.278136
H  3.042583 2.809664 2.720777
H  5.381472 0.433696 2.801104
totalener: -1406.20659552 hartree
nucrepener: 1893.83291325 hartree
electener: -3300.03950877 hartree
oneelecener: -5672.71340803 hartree
twoeener: 2372.67389926 hartree
kineticenergy: 1401.46439223 hartree
exchangeener: -105.458442066450 hartree
correlationener: -7.059401357173 hartree
xcener: -112.517843423623 hartree
temp: 298.15 k
press: 1.00 atm
thermalcorrenthalpy: 0.00094421 hartree
totalenthalpy: -1405.95533110 hartree
totalentropycorr: -0.06969380 hartree
gibbsenthalpy: -1406.02502490 hartree
gibbsminuselec: 0.26321972 hartree
chargesum: 1.0000000
charge: -0.175868 0.184754 -0.071653 0.139941 0.259595 -0.277928 0.149936 0.040289 -0.345070 -0.183734 0.132497 -0.156115 0.189407 0.119114 0.115561 -0.265969 0.244049 0.108164 -0.144091 0.125587 0.231655 -0.387161 -0.164698 0.118381 0.137073 -0.210412 0.112135 0.127018 -0.011727 0.196784 -0.053931 0.243577 0.242778 0.247591 -0.263762 -0.257556 0.255129 0.248659
charge: 0.328963 -0.011093 -0.060727 0.040028 -0.453810 0.135725 -0.385748 -0.140659 0.089093 0.349531 0.038670 -0.249314 -0.009305 0.012084 0.001405 0.365880 -0.080721 0.028957 0.495736 -0.143220 -0.375026 0.074220 0.010390 0.025731 0.041356 -0.003899 0.030395 0.035034 -0.042785 0.047820 0.615069 0.063929 0.058569 -0.462676 0.154647 0.382222 -0.066943 0.060471
qa: -0.1759 0.1848 -0.0717 0.1399 0.2596 -0.2779 0.1499 0.0403 -0.3451 -0.1837 0.1325 -0.1561 0.1894 0.1191 0.1156 -0.2660 0.2440 0.1082 -0.1441 0.1256 0.2317 -0.3872 -0.1647 0.1184 0.1371 -0.2104 0.1121 0.1270 -0.0117 0.1968 -0.0539 0.2436 0.2428 0.2476 -0.2638 -0.2576 0.2551 0.2487
va: 3.1520 1.0194 3.8060 1.0091 4.3569 2.2104 4.3099 3.7031 2.1477 3.1197 1.0217 4.0431 1.0139 1.0081 1.0125 2.2142 1.0125 1.0288 2.1591 1.0275 4.2750 2.1224 3.8276 1.0652 1.0133 3.9298 1.0073 1.0265 3.7628 1.0099 3.6224 0.9714 0.9678 4.4195 2.2113 2.2512 1.0057 0.9735
dispcorr: -0.081787690 hartree
energy: -1406.290643433994
dipole: 14.61295 -8.34299 6.26995 -0.48581 2.14054 1.65473 1.38679 1.26175 2.64854
magnitude: 7.00466 au
magnitude: 17.80442 debye
zeropoint: 0.31074978 hartree
thermalvibcorrection: 0.01903410 hartree
thermalrotcorrection: 0.00141627 hartree
thermaltrasncorrection: 0.00141627 hartree
thermaltotal: -1405.95802701 hartree
thermalcorr: 0.02186665 hartree
nonthermalcorr: 0.31074978 hartree
totalcorr: 0.33261642 hartree
totalenthalpy: -1405.95708280 hartree
