program: Orca
programVersion: 5.0.2
elementType: N H C H C O C C O N H C H H H O H H S H C O C H H C H H C H N H H C O O H H
charge: 1
multiplicity: 1
keywords: wB97X-D3BJ Opt Freq def2-TZVPP def2/J RIJCOSX VeryTightSCF
keywords: PAL8 defgrid3 TightOpt
frequency: 0.00 0.00 0.00 0.00 0.00 0.00 23.48 43.27 47.56 50.69 61.31 76.53 81.14 88.22 101.88 108.79 122.00 136.83 144.33 164.39 198.24 222.83 259.94 267.12 268.75 282.30 289.78 315.42 340.99 354.34 395.81 434.60 500.26 507.28 518.45 553.29 576.66 585.87 616.53 619.19 649.70 660.04 720.02 734.70 750.67 762.61 768.85 793.27 795.46 818.11 843.34 880.21 908.74 910.67 933.17 984.02 994.45 1045.72 1056.10 1081.96 1088.87 1103.12 1141.75 1148.76 1164.76 1210.93 1217.19 1241.87 1248.15 1285.31 1291.27 1296.01 1311.05 1324.73 1350.76 1363.63 1367.38 1381.06 1404.62 1431.72 1435.98 1441.14 1448.00 1473.20 1493.53 1499.78 1505.01 1508.95 1524.15 1541.18 1653.05 1661.12 1781.98 1798.44 1807.03 1876.39 2753.63 3071.26 3079.71 3107.63 3114.24 3132.49 3155.22 3162.88 3168.44 3173.98 3193.59 3443.67 3522.11 3534.83 3603.17 3650.21 3671.31 3769.78
frequency: 23.48 43.27 47.56 50.69 61.31 76.53 81.14 88.22 101.88 108.79 122.00 136.83 144.33 164.39 198.24 222.83 259.94 267.12 268.75 282.30 289.78 315.42 340.99 354.34 395.81 434.60 500.26 507.28 518.45 553.29 576.66 585.87 616.53 619.19 649.70 660.04 720.02 734.70 750.67 762.61 768.85 793.27 795.46 818.11 843.34 880.21 908.74 910.67 933.17 984.02 994.45 1045.72 1056.10 1081.96 1088.87 1103.12 1141.75 1148.76 1164.76 1210.93 1217.19 1241.87 1248.15 1285.31 1291.27 1296.01 1311.05 1324.73 1350.76 1363.63 1367.38 1381.06 1404.62 1431.72 1435.98 1441.14 1448.00 1473.20 1493.53 1499.78 1505.01 1508.95 1524.15 1541.18 1653.05 1661.12 1781.98 1798.44 1807.03 1876.39 2753.63 3071.26 3079.71 3107.63 3114.24 3132.49 3155.22 3162.88 3168.44 3173.98 3193.59 3443.67 3522.11 3534.83 3603.17 3650.21 3671.31 3769.78
formula: C10H18N3O6S
InChI: InChI=1S/C10H18N3O6S/c11-5(10(18)19)1-2-7(14)13-6(4-20)9(17)12-3-8(15)16/h5-6,12-13,15,18,20H,1-4H2,11H3
38 atoms
N  -2.055443 -1.837113 -2.213147
H  -2.610539 -1.560605 -3.007608
C  -1.62156 -3.215022 -2.117393
H  -1.749136 -3.599278 -1.107529
C  -0.171325 -3.40252 -2.533423
O  0.685352 -3.854252 -1.802156
C  -1.8344 -0.84032 -1.314746
C  -0.959383 -1.123067 -0.08282
O  -2.302151 0.271039 -1.457305
N  0.014216 -0.047469 0.006533
H  -0.445431 -2.075308 -0.167115
C  -1.839969 -1.133479 1.171391
H  -0.374193 0.885872 -0.037939
H  -1.21317 -1.309377 2.045941
H  -2.318621 -0.162331 1.291235
O  0.064796 -2.995033 -3.774738
H  1.010051 -3.104745 -3.978619
H  -2.243838 -3.814625 -2.783083
S  -3.091112 -2.438459 1.165017
H  -3.970671 -1.814787 0.372374
C  1.366679 -0.087284 0.015878
O  2.05049 0.918699 0.053034
C  2.07923 -1.433166 -0.099231
H  2.850259 -1.405197 0.676763
H  1.448713 -2.303673 0.067402
C  2.688147 -1.485563 -1.502953
H  3.320355 -0.606635 -1.664207
H  1.895958 -1.442447 -2.249512
C  3.471993 -2.764072 -1.769925
H  2.879893 -3.632735 -1.476018
N  4.734888 -2.766055 -0.937606
H  5.333184 -1.975835 -1.187397
H  4.493951 -2.681251 0.0512
C  3.812015 -2.922111 -3.243683
O  2.976495 -2.968455 -4.099279
O  5.131458 -3.001255 -3.458614
H  5.298116 -3.099169 -4.408563
H  5.281337 -3.617378 -1.073718
totalener: -1406.21027892 hartree
nucrepener: 1872.16599105 hartree
electener: -3278.37626997 hartree
oneelecener: -5628.23944178 hartree
twoeener: 2349.86317182 hartree
kineticenergy: 1400.61513876 hartree
exchangeener: -105.314915070561 hartree
correlationener: -7.050783775873 hartree
xcener: -112.365698846434 hartree
temp: 298.15 k
press: 1.00 atm
thermalcorrenthalpy: 0.00094421 hartree
totalenthalpy: -1405.96055673 hartree
totalentropycorr: -0.06647983 hartree
gibbsenthalpy: -1406.02703656 hartree
gibbsminuselec: 0.26377734 hartree
chargesum: 1.0000000
charge: -0.169156 0.198955 -0.065823 0.124524 0.317848 -0.390635 0.148069 0.012297 -0.326482 -0.164092 0.076043 -0.134350 0.206020 0.118111 0.142608 -0.260572 0.251244 0.142793 -0.151467 0.122449 0.185950 -0.347806 -0.202097 0.116014 0.127548 -0.252390 0.161260 0.126045 -0.042246 0.190349 -0.031549 0.243645 0.244811 0.351104 -0.294674 -0.287051 0.265687 0.247012
charge: 0.329997 -0.008483 -0.052116 0.020249 -0.437894 0.084156 -0.394981 -0.147537 0.099688 0.351920 0.018639 -0.238455 0.004214 0.010107 0.015866 0.387103 -0.113335 0.042078 0.501204 -0.141989 -0.394769 0.084505 -0.011740 0.022538 0.016400 -0.004916 0.039906 0.045674 -0.045283 0.044136 0.618638 0.064894 0.057862 -0.417042 0.177356 0.368582 -0.057127 0.059955
qa: -0.1692 0.1990 -0.0658 0.1245 0.3178 -0.3906 0.1481 0.0123 -0.3265 -0.1641 0.0760 -0.1343 0.2060 0.1181 0.1426 -0.2606 0.2512 0.1428 -0.1515 0.1224 0.1860 -0.3478 -0.2021 0.1160 0.1275 -0.2524 0.1613 0.1260 -0.0422 0.1903 -0.0315 0.2436 0.2448 0.3511 -0.2947 -0.2871 0.2657 0.2470
va: 3.0868 1.0098 3.8021 1.0487 4.1962 2.0932 4.3958 3.9104 2.2115 3.1477 1.0159 3.9472 1.0209 1.0094 1.0124 2.2491 1.0408 0.9992 2.1769 1.0211 4.4007 2.1871 3.7710 1.0334 1.0154 3.8649 1.0228 1.0379 3.7108 1.0236 3.6738 0.9765 0.9716 4.2864 2.1876 2.2324 1.0002 0.9699
dispcorr: -0.080932114 hartree
energy: -1406.296556334246
dipole: 8.08366 -2.33662 5.74704 -2.78490 -0.10789 -2.89279 4.03309 -4.52472 -0.49163
magnitude: 6.45278 au
magnitude: 16.40166 debye
zeropoint: 0.31115189 hartree
thermalvibcorrection: 0.01893304 hartree
thermalrotcorrection: 0.00141627 hartree
thermaltrasncorrection: 0.00141627 hartree
thermaltotal: -1405.96363885 hartree
thermalcorr: 0.02176559 hartree
nonthermalcorr: 0.31115189 hartree
totalcorr: 0.33291748 hartree
totalenthalpy: -1405.96269465 hartree
