program: Orca
programVersion: 5.0.2
elementType: N H C H C O C C O N H C H H H O H H S H C O C H H C H H C H N H H C O O H H
charge: 1
multiplicity: 1
keywords: wB97X-D3BJ Opt Freq def2-TZVPP def2/J RIJCOSX VeryTightSCF
keywords: PAL8 defgrid3 TightOpt
frequency: 0.00 0.00 0.00 0.00 0.00 0.00 19.55 30.19 36.11 45.37 52.66 71.28 74.45 82.25 105.30 111.23 128.52 157.06 166.43 211.70 218.01 228.35 250.77 264.72 301.95 332.96 354.26 363.55 397.71 413.36 432.23 478.37 518.58 524.13 530.54 539.63 553.65 587.06 618.68 642.16 651.81 665.25 672.35 711.60 732.15 745.75 750.85 763.74 793.18 844.46 877.37 906.20 916.63 927.90 949.75 958.93 1018.59 1032.97 1037.60 1068.95 1127.63 1151.36 1167.69 1175.03 1178.87 1204.65 1211.89 1228.92 1233.03 1270.54 1276.43 1318.46 1321.03 1329.68 1334.30 1355.63 1360.01 1396.57 1408.82 1423.61 1430.65 1457.58 1471.43 1487.92 1490.96 1495.07 1511.27 1527.96 1541.97 1566.35 1616.61 1677.28 1713.94 1780.69 1864.70 1888.16 2250.20 2761.44 3073.32 3085.13 3100.48 3110.37 3112.05 3118.11 3124.34 3157.70 3170.17 3192.55 3503.02 3572.62 3585.52 3625.01 3792.38 3801.27
frequency: 19.55 30.19 36.11 45.37 52.66 71.28 74.45 82.25 105.30 111.23 128.52 157.06 166.43 211.70 218.01 228.35 250.77 264.72 301.95 332.96 354.26 363.55 397.71 413.36 432.23 478.37 518.58 524.13 530.54 539.63 553.65 587.06 618.68 642.16 651.81 665.25 672.35 711.60 732.15 745.75 750.85 763.74 793.18 844.46 877.37 906.20 916.63 927.90 949.75 958.93 1018.59 1032.97 1037.60 1068.95 1127.63 1151.36 1167.69 1175.03 1178.87 1204.65 1211.89 1228.92 1233.03 1270.54 1276.43 1318.46 1321.03 1329.68 1334.30 1355.63 1360.01 1396.57 1408.82 1423.61 1430.65 1457.58 1471.43 1487.92 1490.96 1495.07 1511.27 1527.96 1541.97 1566.35 1616.61 1677.28 1713.94 1780.69 1864.70 1888.16 2250.20 2761.44 3073.32 3085.13 3100.48 3110.37 3112.05 3118.11 3124.34 3157.70 3170.17 3192.55 3503.02 3572.62 3585.52 3625.01 3792.38 3801.27
formula: C10H18N3O6S
InChI: InChI=1S/C10H18N3O6S/c11-5(10(18)19)1-2-7(14)13-6(4-20)9(17)12-3-8(15)16/h5-6,12-13,15,18,20H,1-4H2,11H3
38 atoms
N  -1.229067 -2.099255 2.822048
H  -0.91106 -2.366586 3.745579
C  -2.592514 -2.460756 2.509036
H  -3.207818 -1.593549 2.253793
C  -3.200381 -3.116026 3.734311
O  -2.607637 -3.304188 4.760859
C  -0.343417 -1.460758 2.039918
C  -0.820977 -1.079478 0.618628
O  0.781998 -1.171922 2.410688
N  0.025525 -0.013236 0.103007
H  -1.802793 -0.617837 0.725991
C  -0.9958 -2.273539 -0.358281
H  -0.351616 0.918792 0.195165
H  -2.051951 -2.394992 -0.591544
H  -0.478614 -2.0301 -1.283519
O  -4.472162 -3.45562 3.511134
H  -4.818347 -3.875002 4.310821
H  -2.651777 -3.18147 1.689227
S  -0.351401 -3.849657 0.290884
H  -0.464333 -4.519866 -0.860924
C  1.368918 0.000549 0.034898
O  1.941009 1.106716 0.004176
C  2.144522 -1.278618 -0.152911
H  1.526292 -2.145446 0.055511
H  2.39679 -1.325592 -1.217162
C  3.410768 -1.40841 0.703109
H  3.735535 -2.446869 0.642689
H  3.162672 -1.216575 1.748762
C  4.621893 -0.565118 0.303353
H  5.486303 -0.891566 0.887573
N  4.400845 0.885448 0.592353
H  3.372178 1.111773 0.279939
H  4.472854 1.068954 1.590211
C  5.01733 -0.762665 -1.157626
O  4.89311 -1.799273 -1.736886
O  5.559687 0.350133 -1.685107
H  5.836995 0.161079 -2.592698
H  5.07153 1.468886 0.095973
totalener: -1406.23395427 hartree
nucrepener: 1821.58497563 hartree
electener: -3227.81892990 hartree
oneelecener: -5528.09788516 hartree
twoeener: 2300.27895526 hartree
kineticenergy: 1400.64187675 hartree
exchangeener: -105.322013571526 hartree
correlationener: -7.055462323561 hartree
xcener: -112.377475895087 hartree
temp: 298.15 k
press: 1.00 atm
thermalcorrenthalpy: 0.00094421 hartree
totalenthalpy: -1405.98701115 hartree
totalentropycorr: -0.06591916 hartree
gibbsenthalpy: -1406.05293032 hartree
gibbsminuselec: 0.26178828 hartree
chargesum: 1.0000000
charge: -0.167666 0.201665 -0.074279 0.131916 0.279704 -0.302150 0.222949 0.023330 -0.373033 -0.162219 0.121822 -0.199045 0.185178 0.141224 0.138775 -0.259646 0.244808 0.127177 -0.152216 0.125912 0.284573 -0.400452 -0.145314 0.115393 0.125678 -0.213614 0.138175 0.128778 0.005227 0.152575 -0.083699 0.220774 0.214805 0.271367 -0.252006 -0.285381 0.252031 0.216886
charge: 0.341333 -0.005175 -0.049216 0.029957 -0.432649 0.130664 -0.407107 -0.122257 0.088436 0.350556 0.037583 -0.220185 -0.001561 0.003572 0.007571 0.378346 -0.075741 0.023129 0.507823 -0.141411 -0.314574 0.161065 -0.004721 0.015071 0.040638 0.008047 0.048490 0.035334 -0.059182 0.048458 0.586094 -0.092704 0.036081 -0.432151 0.164954 0.362070 -0.069098 0.022460
qa: -0.1677 0.2017 -0.0743 0.1319 0.2797 -0.3022 0.2229 0.0233 -0.3730 -0.1622 0.1218 -0.1990 0.1852 0.1412 0.1388 -0.2596 0.2448 0.1272 -0.1522 0.1259 0.2846 -0.4005 -0.1453 0.1154 0.1257 -0.2136 0.1382 0.1288 0.0052 0.1526 -0.0837 0.2208 0.2148 0.2714 -0.2520 -0.2854 0.2520 0.2169
va: 3.1681 1.0315 3.8122 0.9977 4.3860 2.1933 4.2747 3.8343 2.1378 3.2144 0.9961 3.9513 1.0177 0.9836 1.0022 2.2340 1.0132 1.0139 2.1611 1.0157 4.2139 2.1156 3.7920 1.0621 1.0213 3.9495 1.0079 1.0259 3.8466 1.0002 3.5147 1.1166 0.9853 4.3576 2.2517 2.1921 1.0098 1.0009
dispcorr: -0.081401155 hartree
energy: -1406.319996529621
dipole: 3.39204 -1.72193 1.67011 3.44444 -1.48454 1.95989 -4.66180 3.47188 -1.18992
magnitude: 2.83661 au
magnitude: 7.21009 debye
zeropoint: 0.30983350 hartree
thermalvibcorrection: 0.01843182 hartree
thermalrotcorrection: 0.00141627 hartree
thermaltrasncorrection: 0.00141627 hartree
thermaltotal: -1405.98889866 hartree
thermalcorr: 0.02126436 hartree
nonthermalcorr: 0.30983350 hartree
totalcorr: 0.33109787 hartree
totalenthalpy: -1405.98795445 hartree
