program: Orca
programVersion: 5.0.2
elementType: N H C H C O C C O N H C H H H O H H S H C O C H H C H H C H N H H C O O H H
charge: 1
multiplicity: 1
keywords: wB97X-D3BJ Opt Freq def2-TZVPP def2/J RIJCOSX VeryTightSCF
keywords: PAL8 defgrid3 TightOpt
frequency: 0.00 0.00 0.00 0.00 0.00 0.00 32.03 43.68 51.03 53.52 62.30 73.91 81.17 99.49 105.08 113.16 122.45 156.88 199.45 207.98 218.80 226.23 244.34 288.27 296.88 313.06 325.55 345.43 374.64 404.29 440.29 461.42 474.87 498.00 518.53 535.81 580.67 592.56 605.97 619.59 623.35 657.11 688.84 702.84 732.30 734.98 745.63 764.86 784.61 808.78 851.88 886.51 902.88 936.51 969.23 980.79 1001.25 1017.42 1064.77 1068.54 1106.51 1140.54 1168.00 1175.83 1189.54 1207.08 1213.46 1245.41 1256.97 1269.77 1275.41 1297.54 1309.73 1318.21 1331.49 1341.11 1361.99 1384.22 1416.99 1421.28 1431.27 1458.61 1465.53 1468.22 1488.92 1490.24 1494.31 1508.73 1514.11 1535.56 1658.04 1684.60 1761.12 1801.04 1840.40 1848.36 2758.68 3083.04 3090.30 3097.28 3099.13 3121.09 3128.16 3143.78 3160.73 3174.99 3176.57 3219.59 3382.34 3464.97 3594.37 3613.03 3787.72 3835.66
frequency: 32.03 43.68 51.03 53.52 62.30 73.91 81.17 99.49 105.08 113.16 122.45 156.88 199.45 207.98 218.80 226.23 244.34 288.27 296.88 313.06 325.55 345.43 374.64 404.29 440.29 461.42 474.87 498.00 518.53 535.81 580.67 592.56 605.97 619.59 623.35 657.11 688.84 702.84 732.30 734.98 745.63 764.86 784.61 808.78 851.88 886.51 902.88 936.51 969.23 980.79 1001.25 1017.42 1064.77 1068.54 1106.51 1140.54 1168.00 1175.83 1189.54 1207.08 1213.46 1245.41 1256.97 1269.77 1275.41 1297.54 1309.73 1318.21 1331.49 1341.11 1361.99 1384.22 1416.99 1421.28 1431.27 1458.61 1465.53 1468.22 1488.92 1490.24 1494.31 1508.73 1514.11 1535.56 1658.04 1684.60 1761.12 1801.04 1840.40 1848.36 2758.68 3083.04 3090.30 3097.28 3099.13 3121.09 3128.16 3143.78 3160.73 3174.99 3176.57 3219.59 3382.34 3464.97 3594.37 3613.03 3787.72 3835.66
formula: C10H18N3O6S
InChI: InChI=1S/C10H18N3O6S/c11-5(10(18)19)1-2-7(14)13-6(4-20)9(17)12-3-8(15)16/h5-6,12-13,15,18,20H,1-4H2,11H3
38 atoms
N  -1.244814 -2.430977 -2.571657
H  -1.073697 -2.470607 -3.566756
C  -1.398408 -3.713724 -1.931884
H  -1.879978 -3.621659 -0.956285
C  -0.044299 -4.407944 -1.742171
O  1.002303 -3.852214 -1.963306
C  -0.608308 -1.371666 -1.990921
C  -0.810387 -1.137678 -0.482446
O  0.064698 -0.604357 -2.66239
N  -0.007573 -0.031954 -0.026975
H  -0.517266 -2.041682 0.057449
C  -2.291435 -0.875503 -0.163018
H  -0.401288 0.877725 -0.230072
H  -2.899251 -1.717152 -0.491655
H  -2.411096 -0.780969 0.914398
O  -0.066255 -5.658331 -1.294925
H  -0.961706 -5.99651 -1.179036
H  -2.050013 -4.34221 -2.542608
S  -2.974524 0.584257 -0.987632
H  -2.728429 1.462424 -0.009398
C  1.363642 -0.001816 -0.036871
O  1.970865 1.048889 -0.044781
C  2.103675 -1.330009 0.019897
H  2.175289 -1.615161 1.073025
H  1.549211 -2.127469 -0.471104
C  3.512554 -1.218878 -0.559824
H  4.008224 -2.192311 -0.50445
H  4.100316 -0.512853 0.023717
C  3.521234 -0.713677 -2.000533
H  3.133392 0.306421 -2.023638
N  2.657777 -1.543904 -2.904425
H  3.151887 -1.624975 -3.802042
H  2.500863 -2.487431 -2.540432
C  4.901724 -0.709951 -2.643613
O  5.10857 -1.209709 -3.721207
O  5.800681 -0.089031 -1.897431
H  6.649781 -0.085033 -2.362611
H  1.720407 -1.122079 -3.024885
totalener: -1406.23448540 hartree
nucrepener: 1885.41217836 hartree
electener: -3291.64666376 hartree
oneelecener: -5654.04705378 hartree
twoeener: 2362.40039002 hartree
kineticenergy: 1400.66091661 hartree
exchangeener: -105.323988526972 hartree
correlationener: -7.055043369256 hartree
xcener: -112.379031896228 hartree
temp: 298.15 k
press: 1.00 atm
thermalcorrenthalpy: 0.00094421 hartree
totalenthalpy: -1405.98726061 hartree
totalentropycorr: -0.06589177 hartree
gibbsenthalpy: -1406.05315238 hartree
gibbsminuselec: 0.26360456 hartree
chargesum: 1.0000000
charge: -0.164752 0.185747 -0.158204 0.127537 0.337706 -0.353173 0.162645 0.074542 -0.355575 -0.176794 0.108207 -0.189103 0.167470 0.114560 0.150432 -0.193502 0.231279 0.166994 -0.116498 0.115651 0.195702 -0.329051 -0.138915 0.140565 0.030778 -0.200806 0.125343 0.145248 -0.007707 0.166330 -0.067416 0.223056 0.230233 0.301801 -0.311820 -0.233827 0.252183 0.243135
charge: 0.325413 -0.005310 -0.062860 0.033739 -0.427369 0.108227 -0.366327 -0.162432 0.122795 0.321948 0.031899 -0.235041 -0.017472 0.005741 0.016066 0.416630 -0.081784 0.041293 0.514097 -0.145521 -0.380685 0.107201 -0.010787 0.045296 0.008229 0.000534 0.033535 0.047433 -0.045111 0.050060 0.613880 0.029499 0.030227 -0.429423 0.130591 0.410123 -0.063731 -0.010605
qa: -0.1648 0.1857 -0.1582 0.1275 0.3377 -0.3532 0.1626 0.0745 -0.3556 -0.1768 0.1082 -0.1891 0.1675 0.1146 0.1504 -0.1935 0.2313 0.1670 -0.1165 0.1157 0.1957 -0.3291 -0.1389 0.1406 0.0308 -0.2008 0.1253 0.1452 -0.0077 0.1663 -0.0674 0.2231 0.2302 0.3018 -0.3118 -0.2338 0.2522 0.2431
va: 3.1301 1.0179 3.9008 0.9942 4.2377 2.1032 4.2643 3.8337 2.1324 3.1296 0.9926 3.9645 1.0566 1.0067 1.0005 2.2964 1.0134 0.9886 2.1822 1.0188 4.3337 2.1847 3.7791 1.0102 1.0549 3.9151 1.0047 1.0232 3.7919 1.0291 3.5873 1.0156 1.0084 4.3488 2.1825 2.2783 1.0070 1.0451
dispcorr: -0.083011782 hartree
energy: -1406.322952206732
dipole: -2.11198 1.62065 -0.49134 -5.34410 2.69269 -2.65142 4.52766 -4.75018 -0.22252
magnitude: 2.70572 au
magnitude: 6.87740 debye
zeropoint: 0.31097432 hartree
thermalvibcorrection: 0.01841681 hartree
thermalrotcorrection: 0.00141627 hartree
thermaltrasncorrection: 0.00141627 hartree
thermaltotal: -1405.99072853 hartree
thermalcorr: 0.02124936 hartree
nonthermalcorr: 0.31097432 hartree
totalcorr: 0.33222368 hartree
totalenthalpy: -1405.98978432 hartree
