program: Orca
programVersion: 5.0.2
elementType: N H C H C O C C O N H C H H H O H H S H C O C H H C H H C H N H H C O O H H
charge: 1
multiplicity: 1
keywords: wB97X-D3BJ Opt Freq def2-TZVPP def2/J RIJCOSX VeryTightSCF
keywords: PAL8 defgrid3 TightOpt
frequency: 0.00 0.00 0.00 0.00 0.00 0.00 24.35 26.03 30.36 32.84 46.82 55.52 68.14 76.26 89.96 110.09 120.66 144.16 156.26 181.67 208.09 213.11 234.65 248.37 268.32 281.70 297.50 332.83 342.52 372.81 398.20 446.45 482.60 498.28 512.66 520.77 561.01 589.87 601.68 605.83 646.06 662.14 679.72 697.43 713.19 754.14 764.09 779.41 806.68 840.55 850.53 862.70 897.39 924.85 930.82 980.92 1004.14 1023.04 1065.49 1077.30 1100.92 1114.36 1148.12 1163.83 1175.68 1204.57 1216.49 1237.02 1258.87 1286.32 1298.77 1304.20 1317.28 1339.56 1347.14 1357.99 1384.77 1393.78 1404.75 1425.57 1438.78 1449.58 1457.71 1478.66 1485.21 1495.28 1499.08 1502.97 1515.16 1525.78 1648.22 1673.58 1758.46 1805.51 1833.57 1852.11 2748.24 3083.13 3089.22 3099.75 3109.36 3118.95 3125.88 3148.23 3164.75 3169.70 3207.38 3237.44 3504.40 3560.28 3609.74 3640.16 3781.19 3794.55
frequency: 24.35 26.03 30.36 32.84 46.82 55.52 68.14 76.26 89.96 110.09 120.66 144.16 156.26 181.67 208.09 213.11 234.65 248.37 268.32 281.70 297.50 332.83 342.52 372.81 398.20 446.45 482.60 498.28 512.66 520.77 561.01 589.87 601.68 605.83 646.06 662.14 679.72 697.43 713.19 754.14 764.09 779.41 806.68 840.55 850.53 862.70 897.39 924.85 930.82 980.92 1004.14 1023.04 1065.49 1077.30 1100.92 1114.36 1148.12 1163.83 1175.68 1204.57 1216.49 1237.02 1258.87 1286.32 1298.77 1304.20 1317.28 1339.56 1347.14 1357.99 1384.77 1393.78 1404.75 1425.57 1438.78 1449.58 1457.71 1478.66 1485.21 1495.28 1499.08 1502.97 1515.16 1525.78 1648.22 1673.58 1758.46 1805.51 1833.57 1852.11 2748.24 3083.13 3089.22 3099.75 3109.36 3118.95 3125.88 3148.23 3164.75 3169.70 3207.38 3237.44 3504.40 3560.28 3609.74 3640.16 3781.19 3794.55
formula: C10H18N3O6S
InChI: InChI=1S/C10H18N3O6S/c11-5(10(18)19)1-2-7(14)13-6(4-20)9(17)12-3-8(15)16/h5-6,12-13,15,18,20H,1-4H2,11H3
38 atoms
N  -1.118338 -1.271761 -2.473577
H  -0.975354 -1.849006 -3.288134
C  -1.276756 0.145843 -2.703105
H  -1.864192 0.289501 -3.6128
C  0.049854 0.86516 -2.897133
O  1.071941 0.327671 -3.235018
C  -0.814118 -1.907191 -1.314521
C  -0.890629 -1.135032 0.012686
O  -0.474603 -3.083278 -1.30982
N  0.012983 -0.00021 0.003472
H  -0.580734 -1.860586 0.766683
C  -2.333889 -0.747174 0.359243
H  -0.364544 0.905831 0.243703
H  -2.811033 -0.175029 -0.434491
H  -2.912268 -1.663039 0.475074
O  -0.076304 2.1724 -2.671148
H  0.784495 2.593139 -2.805948
H  -1.825873 0.633119 -1.904908
S  -2.483531 0.28979 1.829391
H  -1.968838 -0.586999 2.700569
C  1.380467 -0.067367 0.038918
O  2.069232 0.928396 0.078819
C  2.020488 -1.453223 -0.007836
H  2.844101 -1.404269 0.708817
H  1.327982 -2.23112 0.311785
C  2.530522 -1.761912 -1.424707
H  3.482839 -1.256966 -1.607998
H  1.840751 -1.37996 -2.175604
C  2.650925 -3.259241 -1.677051
H  1.675407 -3.730492 -1.542978
N  3.642303 -3.906283 -0.73528
H  4.442442 -4.189845 -1.331971
H  3.955921 -3.25877 -0.013843
C  3.200615 -3.567053 -3.064757
O  4.27593 -4.096166 -3.214456
O  2.385769 -3.179192 -4.024974
H  2.789722 -3.366885 -4.885216
H  3.263971 -4.736205 -0.28221
totalener: -1406.21288917 hartree
nucrepener: 1905.09742884 hartree
electener: -3311.31031800 hartree
oneelecener: -5694.29966241 hartree
twoeener: 2382.98934441 hartree
kineticenergy: 1400.63585136 hartree
exchangeener: -105.317432413637 hartree
correlationener: -7.053409217209 hartree
xcener: -112.370841630845 hartree
temp: 298.15 k
press: 1.00 atm
thermalcorrenthalpy: 0.00094421 hartree
totalenthalpy: -1405.96558121 hartree
totalentropycorr: -0.06631304 hartree
gibbsenthalpy: -1406.03189425 hartree
gibbsminuselec: 0.26349378 hartree
chargesum: 1.0000000
charge: -0.146350 0.188457 -0.096013 0.146144 0.317791 -0.332193 0.125071 0.085105 -0.379991 -0.204383 0.117352 -0.186512 0.189700 0.125197 0.143039 -0.252355 0.249423 0.114503 -0.113039 0.101726 0.157570 -0.317273 -0.196152 0.130432 0.103731 -0.212769 0.162901 0.123310 -0.034540 0.179060 -0.037737 0.233244 0.235283 0.310751 -0.304263 -0.222068 0.254540 0.241308
charge: 0.339928 -0.006626 -0.047772 0.043572 -0.449413 0.115944 -0.375365 -0.154766 0.065360 0.324152 0.031543 -0.240871 -0.022741 0.004741 0.018055 0.386023 -0.073152 0.024936 0.505310 -0.145724 -0.383346 0.105149 -0.012069 0.027564 0.018048 -0.000823 0.039462 0.031242 -0.040213 0.040635 0.620255 0.030889 0.050322 -0.426939 0.140373 0.420825 -0.058746 0.054237
qa: -0.1463 0.1885 -0.0960 0.1461 0.3178 -0.3322 0.1251 0.0851 -0.3800 -0.2044 0.1174 -0.1865 0.1897 0.1252 0.1430 -0.2524 0.2494 0.1145 -0.1130 0.1017 0.1576 -0.3173 -0.1962 0.1304 0.1037 -0.2128 0.1629 0.1233 -0.0345 0.1791 -0.0377 0.2332 0.2353 0.3108 -0.3043 -0.2221 0.2545 0.2413
va: 3.1201 1.0193 3.8879 0.9956 4.2809 2.1561 4.3448 3.6833 2.1293 3.0138 1.0116 3.9653 1.0374 0.9980 0.9992 2.2474 1.0100 1.0217 2.1762 1.0243 4.4281 2.2118 3.7756 1.0249 1.0244 3.7546 1.0077 1.0795 3.7910 1.0353 3.6192 1.0253 0.9785 4.3387 2.1914 2.2993 1.0041 0.9711
dispcorr: -0.082475185 hartree
energy: -1406.301417083056
dipole: 1.76545 0.14057 1.90601 -6.11348 3.03768 -3.07580 3.50404 -3.67855 -0.17450
magnitude: 3.62269 au
magnitude: 9.20816 debye
zeropoint: 0.31036156 hartree
thermalvibcorrection: 0.01923324 hartree
thermalrotcorrection: 0.00141627 hartree
thermaltrasncorrection: 0.00141627 hartree
thermaltotal: -1405.96898974 hartree
thermalcorr: 0.02206578 hartree
nonthermalcorr: 0.31036156 hartree
totalcorr: 0.33242734 hartree
totalenthalpy: -1405.96804553 hartree
