program: Orca
programVersion: 5.0.2
elementType: N H C H C O C C O N H C H H H O H H S H C O C H H C H H C H N H H C O O H H
charge: 1
multiplicity: 1
keywords: wB97X-D3BJ Opt Freq def2-TZVPP def2/J RIJCOSX VeryTightSCF
keywords: PAL8 defgrid3 TightOpt
frequency: 0.00 0.00 0.00 0.00 0.00 0.00 16.02 17.01 26.41 32.78 43.60 47.88 63.22 74.02 82.59 90.40 113.57 148.92 164.17 201.29 205.78 244.41 259.31 267.16 297.31 309.59 335.14 368.53 395.46 416.27 432.99 447.27 498.16 513.63 527.96 545.15 564.84 576.01 585.39 599.54 628.13 650.90 664.12 708.81 717.16 732.90 757.41 767.75 809.14 835.01 852.43 872.40 910.73 924.73 949.30 988.12 1003.16 1013.46 1072.69 1088.44 1118.74 1135.92 1138.17 1167.23 1175.37 1188.99 1203.27 1236.56 1247.02 1271.60 1299.93 1306.74 1316.02 1329.88 1345.07 1354.12 1373.87 1377.45 1382.43 1421.00 1422.27 1430.20 1467.46 1481.74 1488.68 1495.11 1499.67 1502.08 1537.77 1563.35 1629.93 1676.56 1724.28 1798.82 1891.87 1899.64 2283.16 2758.59 3076.48 3089.85 3098.19 3110.31 3113.91 3125.86 3152.43 3163.71 3168.30 3198.20 3506.25 3568.63 3618.55 3641.25 3785.54 3839.10
frequency: 16.02 17.01 26.41 32.78 43.60 47.88 63.22 74.02 82.59 90.40 113.57 148.92 164.17 201.29 205.78 244.41 259.31 267.16 297.31 309.59 335.14 368.53 395.46 416.27 432.99 447.27 498.16 513.63 527.96 545.15 564.84 576.01 585.39 599.54 628.13 650.90 664.12 708.81 717.16 732.90 757.41 767.75 809.14 835.01 852.43 872.40 910.73 924.73 949.30 988.12 1003.16 1013.46 1072.69 1088.44 1118.74 1135.92 1138.17 1167.23 1175.37 1188.99 1203.27 1236.56 1247.02 1271.60 1299.93 1306.74 1316.02 1329.88 1345.07 1354.12 1373.87 1377.45 1382.43 1421.00 1422.27 1430.20 1467.46 1481.74 1488.68 1495.11 1499.67 1502.08 1537.77 1563.35 1629.93 1676.56 1724.28 1798.82 1891.87 1899.64 2283.16 2758.59 3076.48 3089.85 3098.19 3110.31 3113.91 3125.86 3152.43 3163.71 3168.30 3198.20 3506.25 3568.63 3618.55 3641.25 3785.54 3839.10
formula: C10H18N3O6S
InChI: InChI=1S/C10H18N3O6S/c11-5(10(18)19)1-2-7(14)13-6(4-20)9(17)12-3-8(15)16/h5-6,12-13,15,18,20H,1-4H2,11H3
38 atoms
N  -1.082338 -2.773307 -2.115004
H  -0.980489 -2.997746 -3.092771
C  -1.54034 -3.799313 -1.195235
H  -2.346326 -3.457687 -0.54784
C  -0.425843 -4.324947 -0.285324
O  -0.597416 -4.601468 0.861977
C  -0.557645 -1.564441 -1.754625
C  -0.884275 -1.070599 -0.330609
O  0.097691 -0.889913 -2.521429
N  -0.020057 0.044599 0.009546
H  -0.760497 -1.865626 0.405474
C  -2.342438 -0.597454 -0.275427
H  -0.399496 0.971002 -0.126076
H  -2.472784 0.282229 -0.908869
H  -2.993498 -1.369215 -0.68319
O  0.798098 -4.424516 -0.854464
H  0.758381 -4.178924 -1.785164
H  -1.931068 -4.634247 -1.77898
S  -2.948671 -0.294195 1.397125
H  -2.255256 0.824515 1.635254
C  1.31216 0.026524 0.080341
O  1.937849 1.102243 0.110841
C  2.044193 -1.292773 0.174243
H  2.450249 -1.348836 1.188953
H  1.367355 -2.135769 0.076246
C  3.167673 -1.455921 -0.860596
H  2.812215 -1.165913 -1.854291
H  3.427498 -2.513164 -0.912684
C  4.472304 -0.725789 -0.534905
H  4.737164 -0.905537 0.510004
N  4.327601 0.75249 -0.691938
H  4.324934 1.01286 -1.676743
H  3.356516 1.025022 -0.263573
C  5.625809 -1.272398 -1.374922
O  5.8312 -2.439425 -1.513074
O  6.369311 -0.287168 -1.909143
H  7.09629 -0.686608 -2.408487
H  5.093797 1.257288 -0.252941
totalener: -1406.22438323 hartree
nucrepener: 1822.53380279 hartree
electener: -3228.75818602 hartree
oneelecener: -5528.27199504 hartree
twoeener: 2299.51380901 hartree
kineticenergy: 1400.61681486 hartree
exchangeener: -105.311790726584 hartree
correlationener: -7.050640231402 hartree
xcener: -112.362430957986 hartree
temp: 298.15 k
press: 1.00 atm
thermalcorrenthalpy: 0.00094421 hartree
totalenthalpy: -1405.97615870 hartree
totalentropycorr: -0.06661117 hartree
gibbsenthalpy: -1406.04276987 hartree
gibbsminuselec: 0.26091986 hartree
chargesum: 1.0000000
charge: -0.248760 0.205652 -0.103423 0.129010 0.246398 -0.239296 0.159324 0.053373 -0.315905 -0.135925 0.143093 -0.210962 0.184098 0.138247 0.121045 -0.241447 0.217141 0.149142 -0.094569 0.097479 0.249666 -0.397057 -0.083673 0.132418 0.087883 -0.242052 0.124657 0.149338 -0.002899 0.141413 -0.072181 0.215197 0.221176 0.275837 -0.247669 -0.286966 0.255920 0.225281
charge: 0.317817 -0.015670 -0.052997 0.033731 -0.457666 0.161642 -0.391680 -0.142998 0.101941 0.365438 0.033470 -0.244863 0.002859 0.013095 0.014847 0.372193 -0.112092 0.043169 0.509647 -0.152799 -0.319056 0.158384 0.008396 0.046611 0.028771 0.005809 0.036125 0.047156 -0.057832 0.050041 0.586215 0.039084 -0.088923 -0.433789 0.167973 0.356858 -0.067142 0.036233
qa: -0.2488 0.2057 -0.1034 0.1290 0.2464 -0.2393 0.1593 0.0534 -0.3159 -0.1359 0.1431 -0.2110 0.1841 0.1382 0.1210 -0.2414 0.2171 0.1491 -0.0946 0.0975 0.2497 -0.3971 -0.0837 0.1324 0.0879 -0.2421 0.1247 0.1493 -0.0029 0.1414 -0.0722 0.2152 0.2212 0.2758 -0.2477 -0.2870 0.2559 0.2253
va: 3.0509 1.0020 3.8271 1.0160 4.3021 2.2597 4.3353 3.6680 2.2017 3.2379 1.0269 3.9862 1.0232 0.9961 1.0065 2.1871 1.0274 0.9873 2.1713 1.0289 4.2365 2.1288 3.7900 1.0108 1.0338 3.9536 1.0119 1.0214 3.8280 1.0030 3.5395 0.9958 1.1139 4.3868 2.2517 2.2049 1.0069 0.9827
dispcorr: -0.080381730 hartree
energy: -1406.309128351104
dipole: 1.92921 0.48272 2.41193 3.33132 -1.50836 1.82296 -2.13469 0.61199 -1.52270
magnitude: 3.38514 au
magnitude: 8.60435 debye
zeropoint: 0.30904630 hartree
thermalvibcorrection: 0.01892568 hartree
thermalrotcorrection: 0.00141627 hartree
thermaltrasncorrection: 0.00141627 hartree
thermaltotal: -1405.97832383 hartree
thermalcorr: 0.02175822 hartree
nonthermalcorr: 0.30904630 hartree
totalcorr: 0.33080453 hartree
totalenthalpy: -1405.97737962 hartree
