program: Gaussian 09
title: 000007148
version: EM64L-G09RevD.01
frameworkgroup: C1[X(C9H10O)]
method: RPBEPBE
basis: SDD
operation: Freq
keyword: #pfreq=noraman
keyword: PBEPBE/SDD
title: #p freq=noraman PBEPBE/SDD
converged: NO YES NO NO
title: Mulliken charges:
elementType: O C C C C C C C C C H H H H H H H H H H
charge: -0.225285 -0.481075 0.285406 0.136366 -0.345275 -0.344820 -0.683791 -0.242167 -0.226724 -0.223507 0.231243 0.231265 0.243962 0.277705 0.230871 0.208603 0.230786 0.229973 0.233198 0.233265
chargesum: 0.00000
title: Mulliken charges with hydrogens summed into heavy atoms:
elementType: O C C C C C C C C C
charge: -0.225285 -0.018567 0.285406 0.136366 -0.101313 -0.067115 -0.013531 -0.012194 0.006474 0.009757
polarizability: 1.37811515e+02 -3.42108363e+00 1.02186539e+02 1.67838646e-02 1.35168855e-02 4.90613190e+01
1716.lowfreq: -9.4525 -4.2921 -2.9871 0.0004 0.0007 0.0008 48.1691 79.3187 141.9364
frequency: 48.1072 79.3059 141.9230 160.0468 189.0118 289.2751 333.2339 400.2543 416.4371 460.7429 566.6039 613.0664 633.0110 697.3184 735.6393 756.9151 820.2501 859.9262 944.4195 947.8177 989.8333 991.2598 1010.5523 1015.8984 1026.1985 1068.8922 1085.9480 1090.1574 1173.1917 1188.8706 1224.0974 1248.6483 1313.2320 1338.6984 1387.0889 1395.5564 1435.3617 1439.1316 1466.6394 1476.8054 1479.2250 1572.2143 1599.7961 1613.8081 2969.5152 2997.5848 3015.9526 3093.4657 3101.9218 3127.6213 3137.5747 3149.4076 3158.2072 3168.6512
redmass: 4.4263 1.6996 2.5420 3.4952 1.4611 4.0175 5.2570 2.8113 3.1417 6.1517 2.2163 6.3955 4.9659 1.8413 4.0978 1.5176 1.5197 1.2472 1.3875 4.4645 6.2535 1.3771 1.3342 1.5984 2.0696 1.6711 1.6105 2.5991 1.0654 1.1253 2.7800 1.1813 1.4118 1.8103 9.0439 1.2144 2.0322 1.1725 1.0392 1.0660 2.1235 6.5252 6.6789 6.6572 1.0601 1.0364 1.0979 1.1002 1.0998 1.0850 1.0880 1.0922 1.0959 1.1013
irintensity: 2.1689 1.4050 0.0761 1.0841 0.8874 10.6020 0.1207 0.0675 1.2536 4.6027 5.0030 0.0999 7.1901 47.8825 1.1779 78.0608 0.0993 0.6520 1.6033 47.2399 2.0038 0.3910 0.2136 8.9248 1.0272 1.8244 13.6099 0.0393 2.8241 17.9714 139.6063 0.2587 3.0364 61.9076 1.7930 24.4962 13.7935 22.2615 11.8423 13.8677 1.2105 78.6778 45.4024 13.4766 33.4138 29.4108 10.4309 27.5024 31.3833 0.1032 6.6661 15.0203 25.2361 19.5338
temp: 298.150 k
press: 1.00000 atm
elementType: 8 6 6 6 6 6 6 6 6 6 1 1 1 1 1 1 1 1 1 1
symmnumber: 1
zpe: 428528.2 jmol-1
zpe.correction: 0.163218 hartree
zpe.thermalcorrener: 0.172603 hartree
zpe.thermalcorrenthalpy: 0.173547 hartree
zpe.thermalcorrgfe: 0.128074 hartree
zpe.sumelectzpe: -423.453347 hartree
zpe.sumelectthermal: -423.443961 hartree
zpe.sumelectthermalent: -423.443017 hartree
zpe.sumelectthermalfe: -423.488490 hartree
dipole: 1.8151 -2.7928 0.0021
dipole: 3.3308
quadrupole: -53.5761 -57.8587 -62.0010
quadrupole: 5.6714 -0.0004 0.0100
quadrupole: 4.2358 -0.0468 -4.1891 5.6714 -0.0004 0.0100
hfenergy: -423.6165644 hartree
pointgroup: C01 [X(C9H10O1)]
dipole: -0.724689 1.0918113 -0.002135 debye
dipolederiv: -0.8601274 0.1074402 -0.0005794 0.3132662 -0.7641913 0.0008156 -0.0010123 0.0007997 -0.3004939 -0.1607432 -0.1235926 0.0000184 -0.3145178 -0.2451328 0.0005395 0.0007457 0.0009752 0.1513458 -0.7495864 0.0417538 -0.0005596 -0.0251758 -0.0844123 0.0000126 -0.0005508 0.0001066 -0.0156564 1.6583044 -0.0130852 0.0009991 -0.0235747 0.8377018 -0.000954 0.0010821 -0.001238 0.1072518 0.1095328 0.0904177 -0.0000998 -0.0788972 0.0068498 -0.0003987 0.0001484 -0.0002855 -0.1377392 0.0143213 -0.1355623 0.000389 0.0989963 0.0275656 -0.0003246 0.0000234 -0.0003831 -0.1053376 -0.0416722 0.0319282 -0.0002058 0.0165909 0.0843845 -0.0000506 -0.0003139 -0.0001365 0.061432 -0.1900328 -0.1182221 0.000284 -0.173543 0.0950146 -0.0007639 0.0004491 -0.0007551 -0.1564238 -0.0538557 0.1901805 -0.0004599 0.1782091 0.0222347 -0.0004111 -0.0004118 -0.0003788 -0.156577 0.1342445 -0.019338 0.0001828 0.0072649 0.0225505 -0.0004179 0.0001121 -0.0004467 -0.1385107 -0.000944 0.0327025 -0.0757588 0.0546512 0.0285259 0.0808232 -0.0806925 0.0958314 -0.0293031 -0.0014963 0.0334578 0.0757041 0.0554392 0.0276285 -0.0810006 0.0803995 -0.0961186 -0.0278797 0.0403776 -0.1046519 0.0002403 -0.110702 -0.0175517 0.0003372 0.0002677 0.000332 0.1416282 0.1212886 0.0692893 -0.0002147 0.0196146 0.0037278 0.0004261 -0.000126 0.0003978 0.1530091 0.0676491 0.0114557 0.0191126 0.074205 0.0383384 -0.1077888 0.0524799 -0.091294 -0.0618642 -0.0618962 -0.104077 -0.0000065 -0.1721532 -0.0836045 0.0001951 0.0001206 0.0002909 0.1025565 0.0677106 0.0110325 -0.0187451 0.0735098 0.0392514 0.1075817 -0.0524089 0.0909024 -0.0632106 0.0411776 0.0678609 -0.0002444 0.0892069 -0.0903368 0.0007117 -0.0002979 0.0007077 0.1594474 -0.0107754 -0.0959675 0.0001599 -0.1099541 -0.0393091 0.0004727 0.0001927 0.0004967 0.1582594 -0.1234768 0.0269774 -0.0002163 0.0275635 0.0907652 0.0001948 -0.0002071 0.0001959 0.1580659 unknown
polarizability: 137.8742513|-3.0761643|102.1234494|0.0639757|-0.1310537|49.0616716 unknown
InChI: InChI=1S/C9H10O/c1-2-9(10)8-6-4-3-5-7-8/h3-7H,2H2,1H3
charge 0 multiplicity 1
20 atoms
O  1.802318 -1.521185 0.0043
C  2.301133 0.865501 0.00106
C  -0.135059 -0.089159 0.000802
C  1.351013 -0.338013 0.002172
C  -0.69408 1.218132 -0.002872
C  -1.007319 -1.212018 0.003344
C  3.78568 0.463612 0.004641
C  -2.094055 1.396284 -0.00408
C  -2.404525 -1.034025 0.002174
C  -2.952423 0.271932 -0.001579
H  2.069582 1.492423 -0.884668
H  2.06647 1.497043 0.882549
H  -0.042398 2.098138 -0.004798
H  -0.558274 -2.211056 0.006144
H  4.029175 -0.148772 -0.880195
H  4.431163 1.360293 0.003561
H  4.026156 -0.144356 0.893365
H  -2.516295 2.407228 -0.006985
H  -3.067555 -1.906188 0.004161
H  -4.039308 0.411987 -0.002496
