program: Orca
programVersion: 5.0.2
elementType: N H C H C O C C O N H C H H H O H H S H C O C H H C H H C H N H H C O O H H
charge: 1
multiplicity: 1
keywords: wB97X-D3BJ Opt Freq def2-TZVPP def2/J RIJCOSX VeryTightSCF
keywords: PAL8 defgrid3 TightOpt
frequency: 0.00 0.00 0.00 0.00 0.00 0.00 30.43 41.53 47.94 58.96 70.51 77.33 94.42 114.55 117.33 123.67 137.07 145.33 173.44 180.59 197.06 208.44 241.90 257.53 284.31 288.05 294.90 304.38 311.96 344.73 413.18 428.18 502.48 514.97 533.09 536.89 545.73 559.43 590.60 604.86 620.58 657.82 667.28 718.46 750.09 760.76 766.62 776.35 788.25 807.24 842.62 867.18 889.19 893.09 945.91 977.58 989.14 1030.30 1032.44 1069.57 1085.49 1128.24 1144.25 1164.17 1195.86 1198.67 1204.20 1218.04 1254.18 1274.35 1290.85 1299.13 1337.39 1346.92 1350.64 1353.62 1370.53 1396.55 1406.29 1414.70 1441.55 1458.65 1470.31 1480.68 1489.05 1492.23 1508.84 1509.53 1528.45 1531.44 1652.93 1669.63 1738.14 1766.56 1849.77 1901.70 2753.89 3060.85 3103.20 3108.91 3121.62 3129.63 3146.74 3152.95 3160.14 3179.94 3196.82 3433.41 3515.97 3539.97 3571.74 3649.59 3797.60 3799.12
frequency: 30.43 41.53 47.94 58.96 70.51 77.33 94.42 114.55 117.33 123.67 137.07 145.33 173.44 180.59 197.06 208.44 241.90 257.53 284.31 288.05 294.90 304.38 311.96 344.73 413.18 428.18 502.48 514.97 533.09 536.89 545.73 559.43 590.60 604.86 620.58 657.82 667.28 718.46 750.09 760.76 766.62 776.35 788.25 807.24 842.62 867.18 889.19 893.09 945.91 977.58 989.14 1030.30 1032.44 1069.57 1085.49 1128.24 1144.25 1164.17 1195.86 1198.67 1204.20 1218.04 1254.18 1274.35 1290.85 1299.13 1337.39 1346.92 1350.64 1353.62 1370.53 1396.55 1406.29 1414.70 1441.55 1458.65 1470.31 1480.68 1489.05 1492.23 1508.84 1509.53 1528.45 1531.44 1652.93 1669.63 1738.14 1766.56 1849.77 1901.70 2753.89 3060.85 3103.20 3108.91 3121.62 3129.63 3146.74 3152.95 3160.14 3179.94 3196.82 3433.41 3515.97 3539.97 3571.74 3649.59 3797.60 3799.12
formula: C10H18N3O6S
InChI: InChI=1S/C10H18N3O6S/c11-5(10(18)19)1-2-7(14)13-6(4-20)9(17)12-3-8(15)16/h5-6,12-13,15,18,20H,1-4H2,11H3
38 atoms
N  -1.643132 -0.586078 -2.791575
H  -1.357526 -0.715839 -3.749051
C  -2.864715 0.155533 -2.595542
H  -3.361753 0.243247 -3.560693
C  -2.68473 1.553388 -2.030432
O  -1.748399 1.931346 -1.374874
C  -0.822239 -1.245036 -1.943288
C  -0.867025 -1.089564 -0.408749
O  0.094345 -1.923124 -2.399046
N  0.010556 0.012852 -0.040091
H  -0.424994 -2.01761 -0.053339
C  -2.204471 -0.952043 0.310605
H  -0.378078 0.936814 -0.189812
H  -2.688354 -0.000348 0.101616
H  -2.014448 -0.971029 1.383126
O  -3.744224 2.314822 -2.316296
H  -3.622241 3.177358 -1.896206
H  -3.565716 -0.380213 -1.952812
S  -3.386641 -2.242143 -0.137641
H  -2.656757 -3.285338 0.273902
C  1.366318 -0.001569 -0.026731
O  2.016288 1.031765 0.015955
C  2.10512 -1.333492 -0.06023
H  2.410616 -1.557357 0.964426
H  1.493277 -2.151515 -0.426639
C  3.360067 -1.206358 -0.921429
H  3.90514 -2.155092 -0.873463
H  4.000674 -0.415235 -0.52716
C  3.039209 -0.916776 -2.391359
H  2.277669 -1.590861 -2.783538
N  4.315714 -1.128388 -3.187485
H  4.996358 -0.410586 -2.924363
H  4.711072 -2.048548 -2.993159
C  2.596318 0.523226 -2.670254
O  1.488128 0.843213 -2.966049
O  3.657189 1.349445 -2.590273
H  3.34876 2.26458 -2.64776
H  4.153406 -1.052429 -4.19237
totalener: -1406.20770418 hartree
nucrepener: 1920.28324485 hartree
electener: -3326.49094904 hartree
oneelecener: -5726.60049771 hartree
twoeener: 2400.10954867 hartree
kineticenergy: 1400.63560596 hartree
exchangeener: -105.315331727472 hartree
correlationener: -7.052801816833 hartree
xcener: -112.368133544305 hartree
temp: 298.15 k
press: 1.00 atm
thermalcorrenthalpy: 0.00094421 hartree
totalenthalpy: -1405.95994413 hartree
totalentropycorr: -0.06596200 hartree
gibbsenthalpy: -1406.02590612 hartree
gibbsminuselec: 0.26438217 hartree
chargesum: 1.0000000
charge: -0.130240 0.173764 -0.131009 0.149220 0.330139 -0.341674 0.236685 -0.008620 -0.430285 -0.145664 0.116103 -0.138335 0.210104 0.106420 0.142441 -0.249227 0.243117 0.134263 -0.135258 0.104442 0.159865 -0.355833 -0.177174 0.134203 0.102078 -0.188488 0.095976 0.143593 0.022989 0.197417 -0.056680 0.242963 0.235526 0.222436 -0.226571 -0.291761 0.258019 0.245056
charge: 0.342182 -0.008682 -0.053034 0.043101 -0.440205 0.122636 -0.365747 -0.147421 0.051756 0.342972 0.035439 -0.244221 -0.021566 0.006270 0.013286 0.382650 -0.077572 0.024203 0.502346 -0.145843 -0.384276 0.079801 0.003694 0.041615 0.017806 -0.007466 0.026064 0.036234 -0.030473 0.040531 0.614225 0.055882 0.055135 -0.451634 0.183800 0.362032 -0.065913 0.060394
qa: -0.1302 0.1738 -0.1310 0.1492 0.3301 -0.3417 0.2367 -0.0086 -0.4303 -0.1457 0.1161 -0.1383 0.2101 0.1064 0.1424 -0.2492 0.2431 0.1343 -0.1353 0.1044 0.1599 -0.3558 -0.1772 0.1342 0.1021 -0.1885 0.0960 0.1436 0.0230 0.1974 -0.0567 0.2430 0.2355 0.2224 -0.2266 -0.2918 0.2580 0.2451
va: 3.1216 1.0273 3.8536 1.0064 4.2215 2.1196 4.2294 3.8814 2.0622 3.1247 1.0107 3.9573 1.0317 1.0164 1.0056 2.2486 1.0150 1.0204 2.1738 1.0238 4.3884 2.1567 3.8510 1.0045 1.0382 3.9878 1.0090 1.0186 3.6651 1.0307 3.6581 0.9859 0.9730 4.4250 2.2562 2.1913 1.0083 0.9666
dispcorr: -0.082783124 hartree
energy: -1406.295923724915
dipole: 10.40479 -6.02947 4.37532 -7.20462 6.01155 -1.19308 0.34230 -2.69052 -2.34822
magnitude: 5.10696 au
magnitude: 12.98086 debye
zeropoint: 0.31113363 hartree
thermalvibcorrection: 0.01882216 hartree
thermalrotcorrection: 0.00141627 hartree
thermaltrasncorrection: 0.00141627 hartree
thermaltotal: -1405.96313540 hartree
thermalcorr: 0.02165470 hartree
nonthermalcorr: 0.31113363 hartree
totalcorr: 0.33278833 hartree
totalenthalpy: -1405.96219119 hartree
