program: Orca
programVersion: 5.0.2
elementType: N H C H C O C C O N H C H H H O H H S H C O C H H C H H C H N H H C O O H H
charge: 1
multiplicity: 1
keywords: wB97X-D3BJ Opt Freq def2-TZVPP def2/J RIJCOSX VeryTightSCF
keywords: PAL8 defgrid3 TightOpt
frequency: 0.00 0.00 0.00 0.00 0.00 0.00 16.27 34.46 37.05 52.67 61.81 70.30 84.21 86.90 112.86 121.79 137.85 147.80 164.94 175.74 183.05 200.40 216.44 235.27 256.89 271.96 293.92 301.18 309.16 373.52 419.13 422.49 500.03 512.93 523.77 529.02 546.84 569.83 590.22 609.13 614.71 638.48 659.81 679.73 696.15 750.39 766.24 785.36 793.95 810.81 840.95 884.94 890.95 898.85 950.69 980.01 1018.51 1034.57 1037.19 1073.44 1087.90 1121.37 1143.33 1165.35 1190.53 1205.06 1217.82 1222.02 1253.35 1277.78 1278.80 1305.61 1341.55 1345.51 1355.89 1357.46 1375.31 1391.90 1396.98 1405.54 1419.44 1458.09 1466.92 1481.50 1486.84 1491.69 1506.02 1510.63 1513.36 1535.71 1653.10 1669.34 1739.37 1777.40 1879.52 1898.88 2753.26 3064.51 3069.19 3102.23 3114.47 3124.95 3137.42 3138.93 3151.76 3167.51 3193.38 3433.46 3515.20 3536.69 3625.51 3644.89 3792.12 3805.27
frequency: 16.27 34.46 37.05 52.67 61.81 70.30 84.21 86.90 112.86 121.79 137.85 147.80 164.94 175.74 183.05 200.40 216.44 235.27 256.89 271.96 293.92 301.18 309.16 373.52 419.13 422.49 500.03 512.93 523.77 529.02 546.84 569.83 590.22 609.13 614.71 638.48 659.81 679.73 696.15 750.39 766.24 785.36 793.95 810.81 840.95 884.94 890.95 898.85 950.69 980.01 1018.51 1034.57 1037.19 1073.44 1087.90 1121.37 1143.33 1165.35 1190.53 1205.06 1217.82 1222.02 1253.35 1277.78 1278.80 1305.61 1341.55 1345.51 1355.89 1357.46 1375.31 1391.90 1396.98 1405.54 1419.44 1458.09 1466.92 1481.50 1486.84 1491.69 1506.02 1510.63 1513.36 1535.71 1653.10 1669.34 1739.37 1777.40 1879.52 1898.88 2753.26 3064.51 3069.19 3102.23 3114.47 3124.95 3137.42 3138.93 3151.76 3167.51 3193.38 3433.46 3515.20 3536.69 3625.51 3644.89 3792.12 3805.27
formula: C10H18N3O6S
InChI: InChI=1S/C10H18N3O6S/c11-5(10(18)19)1-2-7(14)13-6(4-20)9(17)12-3-8(15)16/h5-6,12-13,15,18,20H,1-4H2,11H3
38 atoms
N  -1.497875 -0.84295 -2.77086
H  -1.316874 -1.136513 -3.718276
C  -2.386743 0.283466 -2.603204
H  -3.380234 -0.02789 -2.264166
C  -2.610412 1.058755 -3.888737
O  -3.096296 2.151813 -3.909816
C  -0.788657 -1.504488 -1.843928
C  -0.893146 -1.156799 -0.341875
O  0.025344 -2.366251 -2.171906
N  -0.035147 -0.017144 -0.033017
H  -0.483052 -2.039221 0.145663
C  -2.280906 -0.93865 0.257458
H  -0.448686 0.903605 -0.054933
H  -2.190638 -0.931618 1.34329
H  -2.705897 0.023154 -0.02615
O  -2.243872 0.376396 -4.990241
H  -2.46416 0.92284 -5.756527
H  -1.992167 1.007148 -1.891861
S  -3.485867 -2.175057 -0.269105
H  -2.870016 -3.238126 0.261431
C  1.324417 0.008681 -0.050254
O  1.945143 1.057901 -0.05424
C  2.078303 -1.314005 -0.040563
H  2.424811 -1.463171 0.984779
H  1.45912 -2.159642 -0.323296
C  3.29844 -1.243634 -0.955343
H  3.863033 -2.174542 -0.840232
H  3.938834 -0.409803 -0.660413
C  2.913111 -1.100344 -2.431761
H  2.139296 -1.814309 -2.718665
N  4.150211 -1.38313 -3.263953
H  4.844063 -0.648635 -3.100457
H  4.554438 -2.284212 -3.006886
C  2.439636 0.306245 -2.803283
O  1.301944 0.600903 -3.001155
O  3.492553 1.137536 -2.898912
H  3.174216 2.042729 -3.025201
H  3.94108 -1.39857 -4.263116
totalener: -1406.20219583 hartree
nucrepener: 1888.18181350 hartree
electener: -3294.38400933 hartree
oneelecener: -5661.50314614 hartree
twoeener: 2367.11913681 hartree
kineticenergy: 1400.61893873 hartree
exchangeener: -105.311080696594 hartree
correlationener: -7.049497807902 hartree
xcener: -112.360578504496 hartree
temp: 298.15 k
press: 1.00 atm
thermalcorrenthalpy: 0.00094421 hartree
totalenthalpy: -1405.95311178 hartree
totalentropycorr: -0.06682457 hartree
gibbsenthalpy: -1406.01993635 hartree
gibbsminuselec: 0.26321568 hartree
chargesum: 1.0000000
charge: -0.090966 0.172615 -0.089700 0.135266 0.277065 -0.279124 0.188318 -0.007194 -0.422218 -0.151038 0.131851 -0.154089 0.177936 0.149942 0.107140 -0.284219 0.237859 0.118809 -0.121475 0.106541 0.158476 -0.343039 -0.184529 0.137158 0.111242 -0.185553 0.100145 0.145054 0.016630 0.199541 -0.054829 0.243801 0.237961 0.236409 -0.238554 -0.288790 0.259472 0.246089
charge: 0.342419 -0.015984 -0.046780 0.033233 -0.429020 0.139390 -0.389423 -0.147140 0.045563 0.337161 0.037603 -0.248004 -0.013574 0.012838 0.004335 0.355635 -0.080053 0.029818 0.509788 -0.144612 -0.384498 0.083702 0.006271 0.044288 0.019592 -0.005095 0.028320 0.037116 -0.030943 0.041925 0.615178 0.056889 0.057231 -0.447473 0.180190 0.366197 -0.063610 0.061527
qa: -0.0910 0.1726 -0.0897 0.1353 0.2771 -0.2791 0.1883 -0.0072 -0.4222 -0.1510 0.1319 -0.1541 0.1779 0.1499 0.1071 -0.2842 0.2379 0.1188 -0.1215 0.1065 0.1585 -0.3430 -0.1845 0.1372 0.1112 -0.1856 0.1001 0.1451 0.0166 0.1995 -0.0548 0.2438 0.2380 0.2364 -0.2386 -0.2888 0.2595 0.2461
va: 3.0761 1.0485 3.8442 0.9932 4.3842 2.2311 4.2637 3.8156 2.0707 3.1128 0.9999 3.9687 1.0265 0.9987 1.0008 2.1705 1.0196 1.0092 2.1754 1.0239 4.3682 2.1745 3.8405 1.0063 1.0443 3.9780 1.0088 1.0168 3.6662 1.0359 3.6632 0.9843 0.9716 4.3948 2.2343 2.1991 1.0068 0.9661
dispcorr: -0.081677403 hartree
energy: -1406.288526814557
dipole: 11.99200 -6.62784 5.36417 -6.33121 4.68215 -1.64906 4.05136 -5.75876 -1.70740
magnitude: 5.86591 au
magnitude: 14.90996 debye
zeropoint: 0.31045304 hartree
thermalvibcorrection: 0.01921967 hartree
thermalrotcorrection: 0.00141627 hartree
thermaltrasncorrection: 0.00141627 hartree
thermaltotal: -1405.95602157 hartree
thermalcorr: 0.02205221 hartree
nonthermalcorr: 0.31045304 hartree
totalcorr: 0.33250525 hartree
totalenthalpy: -1405.95507736 hartree
