program: Orca
programVersion: 5.0.2
elementType: N H C H C O C C O N H C H H H O H H S H C O C H H C H H C H N H H C O O H H
charge: 1
multiplicity: 1
keywords: wB97X-D3BJ Opt Freq def2-TZVPP def2/J RIJCOSX VeryTightSCF
keywords: PAL8 defgrid3 TightOpt
frequency: 0.00 0.00 0.00 0.00 0.00 0.00 30.84 34.89 51.99 55.66 61.18 65.43 75.11 91.95 100.57 126.87 165.03 173.15 206.42 212.80 217.30 248.67 259.14 295.63 304.73 308.24 334.51 350.08 373.64 423.21 436.04 450.34 483.36 510.06 524.66 552.97 585.38 598.10 618.23 645.54 653.01 666.96 688.91 714.76 723.63 732.36 770.29 785.08 789.38 851.85 862.54 874.11 886.97 931.93 940.37 999.49 1024.67 1038.53 1051.71 1055.75 1116.17 1143.13 1160.62 1165.78 1186.92 1197.12 1213.69 1241.31 1252.35 1279.31 1293.65 1297.06 1308.76 1326.00 1342.65 1355.49 1369.73 1381.02 1417.28 1445.14 1449.58 1452.62 1457.90 1474.38 1489.06 1495.54 1505.77 1510.50 1520.71 1529.41 1638.29 1694.29 1740.08 1755.46 1845.05 1848.19 2748.23 3109.46 3115.14 3116.27 3117.47 3125.05 3125.29 3166.31 3167.78 3178.23 3178.54 3189.19 3392.86 3452.93 3560.96 3629.63 3789.17 3796.22
frequency: 30.84 34.89 51.99 55.66 61.18 65.43 75.11 91.95 100.57 126.87 165.03 173.15 206.42 212.80 217.30 248.67 259.14 295.63 304.73 308.24 334.51 350.08 373.64 423.21 436.04 450.34 483.36 510.06 524.66 552.97 585.38 598.10 618.23 645.54 653.01 666.96 688.91 714.76 723.63 732.36 770.29 785.08 789.38 851.85 862.54 874.11 886.97 931.93 940.37 999.49 1024.67 1038.53 1051.71 1055.75 1116.17 1143.13 1160.62 1165.78 1186.92 1197.12 1213.69 1241.31 1252.35 1279.31 1293.65 1297.06 1308.76 1326.00 1342.65 1355.49 1369.73 1381.02 1417.28 1445.14 1449.58 1452.62 1457.90 1474.38 1489.06 1495.54 1505.77 1510.50 1520.71 1529.41 1638.29 1694.29 1740.08 1755.46 1845.05 1848.19 2748.23 3109.46 3115.14 3116.27 3117.47 3125.05 3125.29 3166.31 3167.78 3178.23 3178.54 3189.19 3392.86 3452.93 3560.96 3629.63 3789.17 3796.22
formula: C10H18N3O6S
InChI: InChI=1S/C10H18N3O6S/c11-5(10(18)19)1-2-7(14)13-6(4-20)9(17)12-3-8(15)16/h5-6,12-13,15,18,20H,1-4H2,11H3
38 atoms
N  -1.346841 -2.398886 -2.465734
H  -1.173725 -2.510692 -3.453829
C  -1.796874 -3.573591 -1.755647
H  -2.448214 -3.323913 -0.917341
C  -0.640756 -4.404057 -1.213205
O  0.49726 -4.01722 -1.145498
C  -0.711672 -1.329446 -1.938045
C  -0.883445 -1.050873 -0.435609
O  -0.071617 -0.569862 -2.658478
N  -0.002359 0.003783 -0.000803
H  -0.669961 -1.965746 0.119201
C  -2.335879 -0.633456 -0.133651
H  -0.396268 0.934758 -0.073564
H  -3.037132 -1.39491 -0.465564
H  -2.446021 -0.529853 0.946097
O  -1.065613 -5.594598 -0.796371
H  -0.315989 -6.089142 -0.436685
H  -2.39409 -4.188717 -2.427725
S  -2.815522 0.96932 -0.817882
H  -2.752283 0.626292 -2.110745
C  1.350706 -0.007448 0.006478
O  1.976873 1.049765 0.040444
C  2.107001 -1.319222 -0.047824
H  2.90679 -1.213746 0.686684
H  1.495663 -2.173155 0.235923
C  2.724817 -1.614768 -1.426749
H  1.972297 -2.008823 -2.109917
H  3.466254 -2.402229 -1.299421
C  3.430357 -0.428582 -2.08625
H  4.096988 0.060247 -1.372871
N  2.466156 0.611426 -2.573849
H  1.520572 0.209418 -2.719336
H  2.364153 1.333721 -1.853616
C  4.259762 -0.824814 -3.303355
O  4.142948 -0.280905 -4.370947
O  5.121208 -1.795534 -3.027871
H  5.646444 -1.980704 -3.819661
H  2.812998 0.982137 -3.464036
totalener: -1406.25034203 hartree
nucrepener: 1887.44642517 hartree
electener: -3293.69676721 hartree
oneelecener: -5658.37095091 hartree
twoeener: 2364.67418370 hartree
kineticenergy: 1400.67825930 hartree
exchangeener: -105.331738374162 hartree
correlationener: -7.056994429159 hartree
xcener: -112.388732803320 hartree
temp: 298.15 k
press: 1.00 atm
thermalcorrenthalpy: 0.00094421 hartree
totalenthalpy: -1406.00293788 hartree
totalentropycorr: -0.06537732 hartree
gibbsenthalpy: -1406.06831520 hartree
gibbsminuselec: 0.26466926 hartree
chargesum: 1.0000000
charge: -0.161832 0.194131 -0.091017 0.121480 0.298407 -0.331810 0.193375 0.057330 -0.407495 -0.137867 0.120539 -0.173313 0.175460 0.122777 0.154614 -0.242028 0.247822 0.159590 -0.117474 0.111276 0.131967 -0.387452 -0.106153 0.147627 0.111125 -0.259405 0.109620 0.142351 0.029657 0.152062 -0.056547 0.230067 0.236041 0.299579 -0.304741 -0.244881 0.252340 0.222781
charge: 0.342445 -0.001522 -0.043854 0.033853 -0.443766 0.114174 -0.366472 -0.143350 0.096338 0.339477 0.034649 -0.232085 -0.024612 0.003518 0.021349 0.391173 -0.072946 0.045913 0.520942 -0.145080 -0.377889 0.069569 0.002424 0.045079 0.025200 -0.000821 0.025346 0.042196 -0.043415 0.050804 0.613741 -0.010104 0.020218 -0.429154 0.134181 0.399861 -0.065653 0.028273
qa: -0.1618 0.1941 -0.0910 0.1215 0.2984 -0.3318 0.1934 0.0573 -0.4075 -0.1379 0.1205 -0.1733 0.1755 0.1228 0.1546 -0.2420 0.2478 0.1596 -0.1175 0.1113 0.1320 -0.3875 -0.1062 0.1476 0.1111 -0.2594 0.1096 0.1424 0.0297 0.1521 -0.0565 0.2301 0.2360 0.2996 -0.3047 -0.2449 0.2523 0.2228
va: 3.1645 1.0122 3.8384 1.0122 4.2680 2.1255 4.2575 3.8381 2.0706 3.1241 1.0055 3.9401 1.0598 1.0131 0.9979 2.2615 1.0106 1.0043 2.1891 1.0252 4.3257 2.0993 3.7686 1.0160 1.0283 3.8966 1.0220 1.0223 3.8322 1.0146 3.5831 1.0622 1.0117 4.3404 2.1875 2.2631 1.0072 1.0094
dispcorr: -0.083380008 hartree
energy: -1406.338352064097
dipole: -0.54060 0.92610 0.38549 -3.26621 1.66040 -1.60582 2.16397 -2.75167 -0.58770
magnitude: 1.75290 au
magnitude: 4.45551 debye
zeropoint: 0.31181907 hartree
thermalvibcorrection: 0.01815556 hartree
thermalrotcorrection: 0.00141627 hartree
thermaltrasncorrection: 0.00141627 hartree
thermaltotal: -1406.00554490 hartree
thermalcorr: 0.02098810 hartree
nonthermalcorr: 0.31181907 hartree
totalcorr: 0.33280717 hartree
totalenthalpy: -1406.00460069 hartree
