program: Orca
programVersion: 5.0.2
elementType: N H C H C O C C O N H C H H H O H H S H C O C H H C H H C H N H H C O O H H
charge: 1
multiplicity: 1
keywords: wB97X-D3BJ Opt Freq def2-TZVPP def2/J RIJCOSX VeryTightSCF
keywords: PAL8 defgrid3 TightOpt
frequency: 0.00 0.00 0.00 0.00 0.00 0.00 18.85 31.20 40.19 52.48 65.30 79.08 82.79 99.04 110.80 133.68 143.16 159.90 170.22 185.85 204.62 210.36 225.09 228.76 248.51 275.43 315.12 321.85 350.46 378.25 420.84 449.95 485.69 519.17 534.19 563.08 601.47 617.83 629.84 632.98 687.03 698.59 721.92 732.67 744.06 757.15 794.52 803.08 806.39 837.40 872.29 899.69 902.90 919.78 962.06 983.41 987.00 1018.35 1024.98 1068.55 1091.95 1102.00 1144.09 1152.18 1164.11 1217.15 1229.36 1245.02 1256.62 1276.47 1288.08 1296.33 1305.64 1333.43 1347.38 1359.88 1375.40 1381.87 1397.24 1403.87 1421.56 1438.84 1461.58 1471.79 1473.36 1486.33 1492.88 1494.88 1511.37 1519.90 1649.59 1671.48 1795.31 1824.62 1838.49 1878.00 2755.78 3078.27 3092.91 3099.40 3110.43 3130.89 3133.51 3155.02 3163.40 3166.84 3186.80 3190.17 3410.16 3498.74 3536.02 3556.05 3614.32 3673.16
frequency: 18.85 31.20 40.19 52.48 65.30 79.08 82.79 99.04 110.80 133.68 143.16 159.90 170.22 185.85 204.62 210.36 225.09 228.76 248.51 275.43 315.12 321.85 350.46 378.25 420.84 449.95 485.69 519.17 534.19 563.08 601.47 617.83 629.84 632.98 687.03 698.59 721.92 732.67 744.06 757.15 794.52 803.08 806.39 837.40 872.29 899.69 902.90 919.78 962.06 983.41 987.00 1018.35 1024.98 1068.55 1091.95 1102.00 1144.09 1152.18 1164.11 1217.15 1229.36 1245.02 1256.62 1276.47 1288.08 1296.33 1305.64 1333.43 1347.38 1359.88 1375.40 1381.87 1397.24 1403.87 1421.56 1438.84 1461.58 1471.79 1473.36 1486.33 1492.88 1494.88 1511.37 1519.90 1649.59 1671.48 1795.31 1824.62 1838.49 1878.00 2755.78 3078.27 3092.91 3099.40 3110.43 3130.89 3133.51 3155.02 3163.40 3166.84 3186.80 3190.17 3410.16 3498.74 3536.02 3556.05 3614.32 3673.16
formula: C10H18N3O6S
InChI: InChI=1S/C10H18N3O6S/c11-5(10(18)19)1-2-7(14)13-6(4-20)9(17)12-3-8(15)16/h5-6,12-13,15,18,20H,1-4H2,11H3
38 atoms
N  -2.446286 -1.025223 -1.259347
H  -3.363942 -0.723392 -1.555487
C  -1.962758 -2.231723 -1.902254
H  -1.634123 -2.985434 -1.18283
C  -0.800223 -2.021898 -2.860763
O  -0.403705 -2.916074 -3.57416
C  -2.222891 -0.660599 0.063934
C  -0.82799 -0.924643 0.65459
O  -3.05513 -0.044783 0.68002
N  0.031813 0.13463 0.140282
H  -0.453473 -1.887777 0.307842
C  -0.890566 -0.949827 2.187417
H  -0.243896 1.057033 0.461117
H  -1.697035 -1.611159 2.502733
H  0.042544 -1.352984 2.577437
O  -0.204994 -0.8369 -2.838144
H  -0.674592 -0.254948 -2.215094
H  -2.765912 -2.697651 -2.473108
S  -1.170461 0.683783 2.927366
H  0.047515 0.814452 3.464468
C  1.374692 0.067781 -0.12952
O  2.04353 1.074329 -0.236229
C  1.998607 -1.298919 -0.367734
H  2.377454 -1.681689 0.584117
H  1.261124 -2.013251 -0.721389
C  3.130676 -1.140119 -1.383779
H  3.948434 -0.57352 -0.934152
H  2.755658 -0.553222 -2.227217
C  3.654786 -2.473915 -1.924685
H  4.182846 -3.062303 -1.176516
N  4.616996 -2.163659 -3.049825
H  4.063134 -1.857768 -3.857664
H  5.267534 -1.421996 -2.787017
C  2.484333 -3.272061 -2.49215
O  1.87213 -4.053198 -1.824824
O  2.201775 -2.875013 -3.730688
H  1.233224 -3.033475 -3.915309
H  5.154432 -2.983466 -3.33428
totalener: -1406.19882052 hartree
nucrepener: 1916.94948614 hartree
electener: -3323.14830666 hartree
oneelecener: -5717.40426044 hartree
twoeener: 2394.25595378 hartree
kineticenergy: 1400.59801815 hartree
exchangeener: -105.303564752236 hartree
correlationener: -7.057672851542 hartree
xcener: -112.361237603778 hartree
temp: 298.15 k
press: 1.00 atm
thermalcorrenthalpy: 0.00094421 hartree
totalenthalpy: -1405.95509258 hartree
totalentropycorr: -0.06475670 hartree
gibbsenthalpy: -1406.01984928 hartree
gibbsminuselec: 0.26267320 hartree
chargesum: 1.0000000
charge: -0.255354 0.199259 -0.074536 0.134006 0.294249 -0.330739 0.211513 -0.008235 -0.269969 -0.218924 0.101056 -0.182574 0.200453 0.130882 0.115180 -0.232767 0.244854 0.159994 -0.113909 0.105140 0.202579 -0.322673 -0.164438 0.131785 0.067146 -0.235542 0.135226 0.130823 0.049305 0.177992 -0.060763 0.246146 0.240645 0.252932 -0.245951 -0.329992 0.268881 0.246320
charge: 0.296744 -0.009951 -0.049149 0.039349 -0.423047 0.171117 -0.373262 -0.155047 0.151864 0.313920 0.022742 -0.230518 -0.016374 0.015377 0.004367 0.396263 -0.101137 0.048558 0.507492 -0.155184 -0.386527 0.107530 -0.003266 0.038435 0.015222 -0.007226 0.035858 0.039136 -0.038783 0.045256 0.617176 0.052627 0.058951 -0.470221 0.164423 0.350116 -0.133735 0.060902
qa: -0.2554 0.1993 -0.0745 0.1340 0.2942 -0.3307 0.2115 -0.0082 -0.2700 -0.2189 0.1011 -0.1826 0.2005 0.1309 0.1152 -0.2328 0.2449 0.1600 -0.1139 0.1051 0.2026 -0.3227 -0.1644 0.1318 0.0671 -0.2355 0.1352 0.1308 0.0493 0.1780 -0.0608 0.2461 0.2406 0.2529 -0.2460 -0.3300 0.2689 0.2463
va: 3.0289 1.0082 3.8379 1.0097 4.2278 2.1925 4.2764 3.8920 2.2279 2.9895 1.0003 4.0646 1.0365 1.0050 0.9964 2.2326 1.0352 1.0038 2.1832 1.0184 4.3039 2.2009 3.8594 1.0107 1.0486 3.9380 1.0201 1.0214 3.7633 0.9975 3.6494 0.9921 0.9685 4.3664 2.2500 2.1573 1.0731 0.9663
dispcorr: -0.082309162 hartree
energy: -1406.289690278550
dipole: 11.57925 -6.70794 4.87131 -4.36286 2.34814 -2.01473 -1.24557 -1.36324 -2.60881
magnitude: 5.88172 au
magnitude: 14.95015 debye
zeropoint: 0.31019027 hartree
thermalvibcorrection: 0.01864624 hartree
thermalrotcorrection: 0.00141627 hartree
thermaltrasncorrection: 0.00141627 hartree
thermaltotal: -1405.95802123 hartree
thermalcorr: 0.02147878 hartree
nonthermalcorr: 0.31019027 hartree
totalcorr: 0.33166905 hartree
totalenthalpy: -1405.95707702 hartree
