program: Orca
programVersion: 5.0.2
elementType: N H C H C O C C O N H C H H H O H H S H C O C H H C H H C H N H H C O O H H
charge: 1
multiplicity: 1
keywords: wB97X-D3BJ Opt Freq def2-TZVPP def2/J RIJCOSX VeryTightSCF
keywords: PAL8 defgrid3 TightOpt
frequency: 0.00 0.00 0.00 0.00 0.00 0.00 9.16 17.07 27.39 33.12 42.21 56.63 60.55 66.97 93.89 111.60 132.28 150.79 157.14 158.79 182.81 200.24 218.04 228.75 261.09 314.28 327.27 336.41 355.28 383.79 407.58 446.19 493.85 520.38 530.30 536.83 554.16 592.50 607.63 626.81 630.29 656.22 663.23 690.90 709.65 727.16 736.35 754.53 782.27 800.04 845.63 881.60 898.88 922.35 952.41 987.49 1031.18 1043.79 1046.50 1051.94 1097.98 1109.79 1151.94 1166.95 1172.09 1189.02 1218.35 1223.47 1248.28 1271.41 1276.66 1291.95 1311.69 1321.08 1326.49 1338.29 1356.78 1371.26 1399.83 1409.49 1424.37 1427.18 1457.51 1462.95 1491.54 1504.12 1511.54 1523.42 1527.29 1530.37 1647.87 1670.36 1769.16 1796.44 1883.55 1899.81 2766.50 3066.84 3070.52 3082.54 3106.01 3108.03 3116.10 3117.72 3123.16 3179.84 3204.93 3436.92 3515.29 3529.90 3578.48 3608.36 3775.90 3799.21
frequency: 9.16 17.07 27.39 33.12 42.21 56.63 60.55 66.97 93.89 111.60 132.28 150.79 157.14 158.79 182.81 200.24 218.04 228.75 261.09 314.28 327.27 336.41 355.28 383.79 407.58 446.19 493.85 520.38 530.30 536.83 554.16 592.50 607.63 626.81 630.29 656.22 663.23 690.90 709.65 727.16 736.35 754.53 782.27 800.04 845.63 881.60 898.88 922.35 952.41 987.49 1031.18 1043.79 1046.50 1051.94 1097.98 1109.79 1151.94 1166.95 1172.09 1189.02 1218.35 1223.47 1248.28 1271.41 1276.66 1291.95 1311.69 1321.08 1326.49 1338.29 1356.78 1371.26 1399.83 1409.49 1424.37 1427.18 1457.51 1462.95 1491.54 1504.12 1511.54 1523.42 1527.29 1530.37 1647.87 1670.36 1769.16 1796.44 1883.55 1899.81 2766.50 3066.84 3070.52 3082.54 3106.01 3108.03 3116.10 3117.72 3123.16 3179.84 3204.93 3436.92 3515.29 3529.90 3578.48 3608.36 3775.90 3799.21
formula: C10H18N3O6S
InChI: InChI=1S/C10H18N3O6S/c11-5(10(18)19)1-2-7(14)13-6(4-20)9(17)12-3-8(15)16/h5-6,12-13,15,18,20H,1-4H2,11H3
38 atoms
N  -1.285851 -1.070376 -2.441628
H  -1.929362 -1.127528 -3.219366
C  0.110435 -1.172135 -2.769248
H  0.65644 -0.244358 -2.574721
C  0.270913 -1.477075 -4.240766
O  -0.619235 -1.577451 -5.033504
C  -1.863148 -1.111198 -1.20945
C  -0.933925 -1.082457 0.02552
O  -3.067158 -1.180825 -1.079107
N  0.004945 0.023919 -0.036652
H  -0.379913 -2.0231 0.023688
C  -1.761493 -1.024344 1.31218
H  -0.417034 0.940367 0.053404
H  -2.509134 -1.813599 1.310851
H  -1.097088 -1.176212 2.163843
O  1.578131 -1.612322 -4.559955
H  1.617167 -1.77299 -5.512652
H  0.607546 -1.97892 -2.224841
S  -2.56083 0.57353 1.591805
H  -3.522729 0.410801 0.67715
C  1.355407 0.035522 -0.01606
O  1.992401 1.07572 -0.042926
C  2.119465 -1.288248 0.029187
H  2.40311 -1.452875 1.073475
H  1.537019 -2.14584 -0.288618
C  3.369742 -1.129276 -0.834193
H  3.894559 -0.236763 -0.483255
H  3.085938 -0.947884 -1.875601
C  4.301739 -2.33188 -0.774299
H  4.445401 -2.673192 0.254249
N  5.673306 -1.917483 -1.269832
H  5.601687 -1.477988 -2.190046
H  6.088992 -1.236269 -0.632875
C  3.810307 -3.526624 -1.592412
O  2.668937 -3.864599 -1.636419
O  4.827716 -4.141615 -2.223267
H  4.487167 -4.911847 -2.702422
H  6.294816 -2.723845 -1.362591
totalener: -1406.19875343 hartree
nucrepener: 1809.31963719 hartree
electener: -3215.51839062 hartree
oneelecener: -5503.44930565 hartree
twoeener: 2287.93091503 hartree
kineticenergy: 1400.59833983 hartree
exchangeener: -105.305604629751 hartree
correlationener: -7.047217711565 hartree
xcener: -112.352822341316 hartree
temp: 298.15 k
press: 1.00 atm
thermalcorrenthalpy: 0.00094421 hartree
totalenthalpy: -1405.94700239 hartree
totalentropycorr: -0.06741008 hartree
gibbsenthalpy: -1406.01441247 hartree
gibbsminuselec: 0.26209318 hartree
chargesum: 1.0000000
charge: -0.171762 0.196086 -0.067809 0.120999 0.288232 -0.278652 0.211775 -0.011663 -0.335812 -0.165794 0.108096 -0.141139 0.190162 0.135942 0.109194 -0.301563 0.238414 0.092393 -0.174080 0.138361 0.204069 -0.356224 -0.206554 0.128093 0.112670 -0.209784 0.140955 0.106194 0.029316 0.156438 -0.045279 0.246168 0.247728 0.297659 -0.246840 -0.297426 0.264618 0.246822
charge: 0.326048 -0.008216 -0.062516 0.031885 -0.423247 0.145597 -0.381045 -0.143347 0.103776 0.340233 0.028517 -0.236202 -0.015444 0.013681 0.006191 0.337417 -0.084938 0.025156 0.487391 -0.140436 -0.398760 0.079838 -0.003559 0.036909 0.009372 -0.011916 0.034949 0.036721 -0.036829 0.051710 0.616787 0.067523 0.062756 -0.429672 0.182410 0.358534 -0.060389 0.053113
qa: -0.1718 0.1961 -0.0678 0.1210 0.2882 -0.2787 0.2118 -0.0117 -0.3358 -0.1658 0.1081 -0.1411 0.1902 0.1359 0.1092 -0.3016 0.2384 0.0924 -0.1741 0.1384 0.2041 -0.3562 -0.2066 0.1281 0.1127 -0.2098 0.1410 0.1062 0.0293 0.1564 -0.0453 0.2462 0.2477 0.2977 -0.2468 -0.2974 0.2646 0.2468
va: 3.1260 1.0303 3.9191 0.9893 4.3666 2.2213 4.3284 3.7815 2.1782 3.0608 1.0016 4.0215 1.0465 1.0116 1.0041 2.1613 1.0180 0.9922 2.1583 1.0251 4.3151 2.1646 3.8501 1.0114 1.0254 3.9118 1.0392 1.0277 3.7005 1.0007 3.6794 0.9714 0.9662 4.3315 2.2306 2.1976 1.0010 0.9790
dispcorr: -0.078708273 hartree
energy: -1406.281776622038
dipole: 14.96429 -6.31648 8.64781 -3.13080 0.42866 -2.70213 3.82524 -4.37324 -0.54800
magnitude: 9.07670 au
magnitude: 23.07113 debye
zeropoint: 0.30987789 hartree
thermalvibcorrection: 0.01934320 hartree
thermalrotcorrection: 0.00141627 hartree
thermaltrasncorrection: 0.00141627 hartree
thermaltotal: -1405.94972299 hartree
thermalcorr: 0.02217574 hartree
nonthermalcorr: 0.30987789 hartree
totalcorr: 0.33205363 hartree
totalenthalpy: -1405.94877878 hartree
