program: Orca
programVersion: 5.0.2
elementType: N H C H C O C C O N H C H H H O H H S H C O C H H C H H C H N H H C O O H H
charge: 1
multiplicity: 1
keywords: wB97X-D3BJ Opt Freq def2-TZVPP def2/J RIJCOSX VeryTightSCF
keywords: PAL8 defgrid3 TightOpt
frequency: 0.00 0.00 0.00 0.00 0.00 0.00 13.17 31.83 38.27 50.44 53.45 63.40 73.93 82.26 85.58 114.50 132.47 148.01 189.29 212.93 229.24 233.56 259.77 299.02 309.94 323.33 343.57 368.00 391.57 415.71 446.44 469.50 479.22 509.31 550.48 557.04 585.00 597.91 609.18 617.48 640.55 665.99 681.44 718.88 727.87 746.49 757.76 791.60 832.29 858.98 874.78 899.63 910.68 917.21 954.94 990.79 1012.24 1023.47 1066.45 1073.64 1115.78 1144.76 1159.09 1173.83 1181.68 1211.81 1221.23 1244.87 1260.81 1283.39 1297.66 1303.07 1321.04 1344.91 1360.33 1374.42 1376.73 1390.63 1428.22 1429.42 1444.71 1461.22 1462.64 1471.90 1489.40 1492.35 1506.74 1517.48 1530.55 1554.04 1650.18 1663.53 1717.73 1786.34 1829.19 1856.75 2348.50 2756.93 3075.28 3086.37 3115.51 3126.45 3128.87 3131.52 3146.73 3150.19 3180.11 3189.57 3435.17 3447.49 3554.24 3634.02 3782.70 3797.96
frequency: 13.17 31.83 38.27 50.44 53.45 63.40 73.93 82.26 85.58 114.50 132.47 148.01 189.29 212.93 229.24 233.56 259.77 299.02 309.94 323.33 343.57 368.00 391.57 415.71 446.44 469.50 479.22 509.31 550.48 557.04 585.00 597.91 609.18 617.48 640.55 665.99 681.44 718.88 727.87 746.49 757.76 791.60 832.29 858.98 874.78 899.63 910.68 917.21 954.94 990.79 1012.24 1023.47 1066.45 1073.64 1115.78 1144.76 1159.09 1173.83 1181.68 1211.81 1221.23 1244.87 1260.81 1283.39 1297.66 1303.07 1321.04 1344.91 1360.33 1374.42 1376.73 1390.63 1428.22 1429.42 1444.71 1461.22 1462.64 1471.90 1489.40 1492.35 1506.74 1517.48 1530.55 1554.04 1650.18 1663.53 1717.73 1786.34 1829.19 1856.75 2348.50 2756.93 3075.28 3086.37 3115.51 3126.45 3128.87 3131.52 3146.73 3150.19 3180.11 3189.57 3435.17 3447.49 3554.24 3634.02 3782.70 3797.96
formula: C10H18N3O6S
InChI: InChI=1S/C10H18N3O6S/c11-5(10(18)19)1-2-7(14)13-6(4-20)9(17)12-3-8(15)16/h5-6,12-13,15,18,20H,1-4H2,11H3
38 atoms
N  -1.803743 -0.42289 -2.11695
H  -2.4762 -0.728689 -2.804225
C  -1.306478 0.932033 -2.271586
H  -0.240159 1.003434 -2.078403
C  -2.020982 1.940281 -1.380682
O  -1.51429 2.46471 -0.417282
C  -1.738607 -1.309247 -1.081004
C  -0.873193 -1.096036 0.176949
O  -2.356593 -2.352499 -1.127025
N  0.01439 0.054748 0.197483
H  -0.263715 -1.997125 0.223215
C  -1.785575 -1.131204 1.408976
H  -0.402322 0.982016 0.279734
H  -2.327366 -2.074805 1.388746
H  -1.186438 -1.098976 2.318177
O  -3.267186 2.166771 -1.782739
H  -3.693852 2.764797 -1.15353
H  -1.47806 1.21745 -3.309217
S  -3.054272 0.153963 1.451529
H  -2.277799 1.158216 1.873432
C  1.33563 0.055969 0.042087
O  1.954154 1.138558 0.054828
C  2.064838 -1.263255 -0.151241
H  2.025876 -1.82244 0.789149
H  1.515997 -1.863726 -0.878703
C  3.510577 -1.147575 -0.645464
H  3.556989 -0.531975 -1.548115
H  3.834955 -2.148431 -0.932499
C  4.541107 -0.624353 0.365897
H  4.388805 -1.086443 1.342122
N  4.442291 0.855684 0.509755
H  5.080936 1.282192 -0.16833
H  3.403222 1.122852 0.313452
C  5.957791 -0.92144 -0.119415
O  6.679816 -0.064184 -0.553408
O  6.251333 -2.211616 -0.022388
H  7.145025 -2.361763 -0.364225
H  4.730041 1.173521 1.431943
totalener: -1406.23345628 hartree
nucrepener: 1802.65137755 hartree
electener: -3208.88483382 hartree
oneelecener: -5489.63641663 hartree
twoeener: 2280.75158281 hartree
kineticenergy: 1400.62891991 hartree
exchangeener: -105.320259101438 hartree
correlationener: -7.053040145633 hartree
xcener: -112.373299247071 hartree
temp: 298.15 k
press: 1.00 atm
thermalcorrenthalpy: 0.00094421 hartree
totalenthalpy: -1405.98385124 hartree
totalentropycorr: -0.06613834 hartree
gibbsenthalpy: -1406.04998957 hartree
gibbsminuselec: 0.26165386 hartree
chargesum: 1.0000000
charge: -0.189876 0.200356 -0.075613 0.110240 0.276807 -0.331909 0.202871 -0.029950 -0.318373 -0.181347 0.113585 -0.148329 0.219346 0.153089 0.118521 -0.236296 0.241925 0.153036 -0.127235 0.106262 0.271424 -0.390302 -0.180708 0.124903 0.141003 -0.248539 0.138080 0.143391 0.023588 0.139878 -0.083347 0.220014 0.219673 0.279829 -0.289845 -0.244533 0.258607 0.219770
charge: 0.322705 -0.003746 -0.051720 0.023680 -0.449012 0.113715 -0.392672 -0.136814 0.108675 0.365259 0.040334 -0.236755 -0.022477 0.023792 0.005090 0.392906 -0.075222 0.041347 0.513106 -0.153713 -0.338591 0.154786 -0.007795 0.040991 0.043373 0.004568 0.038988 0.044688 -0.055601 0.042975 0.592505 0.031958 -0.095963 -0.439457 0.141119 0.399124 -0.062492 0.036345
qa: -0.1899 0.2004 -0.0756 0.1102 0.2768 -0.3319 0.2029 -0.0300 -0.3184 -0.1813 0.1136 -0.1483 0.2193 0.1531 0.1185 -0.2363 0.2419 0.1530 -0.1272 0.1063 0.2714 -0.3903 -0.1807 0.1249 0.1410 -0.2485 0.1381 0.1434 0.0236 0.1399 -0.0833 0.2200 0.2197 0.2798 -0.2898 -0.2445 0.2586 0.2198
va: 3.1253 1.0108 3.8516 1.0082 4.2969 2.1288 4.3635 3.8667 2.2163 3.1897 1.0212 3.9509 1.0406 1.0142 1.0061 2.2553 1.0156 0.9961 2.1880 1.0243 4.1602 2.1081 3.8031 1.0004 0.9973 3.9245 1.0050 1.0167 3.8324 1.0094 3.5460 1.0112 1.1120 4.3693 2.1995 2.2665 1.0012 0.9854
dispcorr: -0.079795518 hartree
energy: -1406.317505935025
dipole: 9.17474 -4.86084 4.31390 -3.04298 3.11098 0.06800 1.32918 -0.86872 0.46046
magnitude: 4.33894 au
magnitude: 11.02870 debye
zeropoint: 0.31023288 hartree
thermalvibcorrection: 0.01834346 hartree
thermalrotcorrection: 0.00141627 hartree
thermaltrasncorrection: 0.00141627 hartree
thermaltotal: -1405.98609705 hartree
thermalcorr: 0.02117600 hartree
nonthermalcorr: 0.31023288 hartree
totalcorr: 0.33140888 hartree
totalenthalpy: -1405.98515284 hartree
