program: Orca
programVersion: 5.0.2
elementType: N H C H C O C C O N H C H H H O H H S H C O C H H C H H C H N H H C O O H H
charge: 1
multiplicity: 1
keywords: wB97X-D3BJ Opt Freq def2-TZVPP def2/J RIJCOSX VeryTightSCF
keywords: PAL8 defgrid3 TightOpt
frequency: 0.00 0.00 0.00 0.00 0.00 0.00 18.77 24.91 40.36 46.44 58.57 62.24 70.89 88.89 106.71 126.50 162.50 170.27 173.42 189.36 206.50 215.87 240.25 250.66 285.63 299.79 329.22 353.58 372.95 403.99 431.59 445.21 503.27 511.85 535.17 549.10 584.18 589.61 618.62 652.14 657.10 670.16 686.96 704.55 731.21 745.09 757.23 783.78 804.38 860.36 869.04 906.17 915.83 931.19 941.74 989.11 1024.92 1033.79 1050.57 1066.38 1119.13 1141.95 1153.44 1169.23 1177.53 1209.55 1213.85 1241.86 1254.89 1265.50 1289.62 1297.93 1308.75 1321.20 1335.07 1350.00 1368.54 1381.49 1423.76 1424.47 1450.69 1460.30 1470.79 1491.59 1493.69 1502.63 1505.62 1515.71 1520.47 1543.94 1636.29 1689.46 1737.37 1756.76 1849.24 1864.26 2767.75 3082.36 3092.38 3102.89 3107.36 3125.02 3127.48 3139.56 3152.29 3161.99 3164.65 3183.93 3401.29 3468.76 3576.90 3580.72 3787.37 3796.37
frequency: 18.77 24.91 40.36 46.44 58.57 62.24 70.89 88.89 106.71 126.50 162.50 170.27 173.42 189.36 206.50 215.87 240.25 250.66 285.63 299.79 329.22 353.58 372.95 403.99 431.59 445.21 503.27 511.85 535.17 549.10 584.18 589.61 618.62 652.14 657.10 670.16 686.96 704.55 731.21 745.09 757.23 783.78 804.38 860.36 869.04 906.17 915.83 931.19 941.74 989.11 1024.92 1033.79 1050.57 1066.38 1119.13 1141.95 1153.44 1169.23 1177.53 1209.55 1213.85 1241.86 1254.89 1265.50 1289.62 1297.93 1308.75 1321.20 1335.07 1350.00 1368.54 1381.49 1423.76 1424.47 1450.69 1460.30 1470.79 1491.59 1493.69 1502.63 1505.62 1515.71 1520.47 1543.94 1636.29 1689.46 1737.37 1756.76 1849.24 1864.26 2767.75 3082.36 3092.38 3102.89 3107.36 3125.02 3127.48 3139.56 3152.29 3161.99 3164.65 3183.93 3401.29 3468.76 3576.90 3580.72 3787.37 3796.37
formula: C10H18N3O6S
InChI: InChI=1S/C10H18N3O6S/c11-5(10(18)19)1-2-7(14)13-6(4-20)9(17)12-3-8(15)16/h5-6,12-13,15,18,20H,1-4H2,11H3
38 atoms
N  -1.547457 -1.596721 -2.793712
H  -1.32376 -1.582739 -3.781767
C  -2.590499 -2.526931 -2.422624
H  -2.369503 -3.045305 -1.488671
C  -2.717261 -3.560175 -3.530193
O  -2.094523 -3.518498 -4.555409
C  -0.797474 -0.807448 -2.017712
C  -1.04659 -0.8155 -0.494835
O  0.08595 -0.102335 -2.505404
N  -0.010399 -0.083677 0.19572
H  -1.059402 -1.853554 -0.153085
C  -2.401765 -0.195036 -0.133502
H  -0.22635 0.888575 0.379657
H  -3.213569 -0.801857 -0.524739
H  -2.482973 -0.172154 0.952123
O  -3.618239 -4.489417 -3.212284
H  -3.694954 -5.109878 -3.95062
H  -3.56415 -2.040662 -2.316619
S  -2.500698 1.494859 -0.797152
H  -3.458812 1.921936 0.031193
C  1.319574 -0.332915 0.148324
O  2.128883 0.545305 0.430711
C  1.823114 -1.714208 -0.231421
H  2.536514 -1.971206 0.553664
H  1.034823 -2.466232 -0.212528
C  2.535589 -1.783621 -1.59586
H  1.812008 -1.867354 -2.40793
H  3.139198 -2.690206 -1.614832
C  3.472226 -0.613216 -1.900593
H  4.12394 -0.417779 -1.047255
N  2.725133 0.653052 -2.19268
H  3.176269 1.114782 -2.989729
H  1.731114 0.453912 -2.421473
C  4.357476 -0.860285 -3.119133
O  4.430498 -0.080629 -4.032947
O  5.03529 -1.996633 -3.02304
H  5.605264 -2.087948 -3.800317
H  2.713649 1.238005 -1.353628
totalener: -1406.24492536 hartree
nucrepener: 1823.63633435 hartree
electener: -3229.88125971 hartree
oneelecener: -5531.06365219 hartree
twoeener: 2301.18239249 hartree
kineticenergy: 1400.66823816 hartree
exchangeener: -105.330991504279 hartree
correlationener: -7.056214168451 hartree
xcener: -112.387205672730 hartree
temp: 298.15 k
press: 1.00 atm
thermalcorrenthalpy: 0.00094421 hartree
totalenthalpy: -1405.99540532 hartree
totalentropycorr: -0.06574028 hartree
gibbsenthalpy: -1406.06114560 hartree
gibbsminuselec: 0.26422666 hartree
chargesum: 1.0000000
charge: -0.135105 0.200393 -0.104799 0.129763 0.290428 -0.301356 0.264516 0.003513 -0.433136 -0.148013 0.129945 -0.198202 0.178711 0.124947 0.154216 -0.255163 0.249525 0.142666 -0.134636 0.129899 0.149383 -0.387183 -0.106999 0.148919 0.096871 -0.270715 0.117297 0.147576 0.024230 0.154642 -0.057558 0.223512 0.228869 0.300793 -0.300833 -0.246359 0.253898 0.235543
charge: 0.355463 0.000474 -0.039523 0.032396 -0.437297 0.130079 -0.375977 -0.150773 0.092083 0.337807 0.032346 -0.218428 -0.015329 0.000831 0.015235 0.383154 -0.072151 0.034230 0.498375 -0.138663 -0.379412 0.071929 0.002789 0.047263 0.025961 -0.000476 0.027201 0.040260 -0.043511 0.050165 0.614565 0.026955 -0.017674 -0.428552 0.138404 0.399540 -0.064502 0.024766
qa: -0.1351 0.2004 -0.1048 0.1298 0.2904 -0.3014 0.2645 0.0035 -0.4331 -0.1480 0.1299 -0.1982 0.1787 0.1249 0.1542 -0.2552 0.2495 0.1427 -0.1346 0.1299 0.1494 -0.3872 -0.1070 0.1489 0.0969 -0.2707 0.1173 0.1476 0.0242 0.1546 -0.0576 0.2235 0.2289 0.3008 -0.3008 -0.2464 0.2539 0.2355
va: 3.1960 1.0305 3.8635 0.9967 4.3751 2.1916 4.1659 3.9060 2.0427 3.1255 0.9890 4.0144 1.0498 0.9980 0.9962 2.2405 1.0092 0.9880 2.1790 1.0162 4.3233 2.1026 3.7850 1.0142 1.0169 3.9109 1.0109 1.0185 3.8378 1.0154 3.5894 1.0116 1.0658 4.3335 2.1911 2.2626 1.0060 1.0055
dispcorr: -0.081163640 hartree
energy: -1406.331714408176
dipole: -0.23378 0.52189 0.28810 -2.90693 1.83839 -1.06854 6.74783 -6.23037 0.51747
magnitude: 1.22170 au
magnitude: 3.10532 debye
zeropoint: 0.31120722 hartree
thermalvibcorrection: 0.01853679 hartree
thermalrotcorrection: 0.00141627 hartree
thermaltrasncorrection: 0.00141627 hartree
thermaltotal: -1405.99913785 hartree
thermalcorr: 0.02136934 hartree
nonthermalcorr: 0.31120722 hartree
totalcorr: 0.33257656 hartree
totalenthalpy: -1405.99819364 hartree
