program: Orca
programVersion: 5.0.2
elementType: N H C H C O C C O N H C H H H O H H S H C O C H H C H H C H N H H C O O H H
charge: 1
multiplicity: 1
keywords: wB97X-D3BJ Opt Freq def2-TZVPP def2/J RIJCOSX VeryTightSCF
keywords: PAL8 defgrid3 TightOpt
frequency: 0.00 0.00 0.00 0.00 0.00 0.00 24.56 38.77 47.25 50.89 65.31 74.41 85.62 96.64 127.62 140.32 152.24 178.11 191.64 216.61 220.55 236.18 267.88 268.57 272.69 308.16 312.59 354.61 360.25 386.46 427.67 452.30 473.68 513.81 534.98 536.70 574.13 595.44 611.94 623.71 660.04 668.40 692.17 710.33 739.36 749.08 754.30 759.73 804.65 850.39 867.38 877.07 894.91 921.22 956.60 997.57 1023.58 1033.45 1060.99 1081.22 1128.57 1160.95 1166.20 1183.75 1184.55 1213.31 1216.01 1228.92 1260.67 1287.39 1300.54 1313.71 1321.05 1353.22 1360.39 1379.00 1384.54 1386.72 1422.19 1429.12 1437.17 1454.77 1467.69 1477.20 1492.17 1492.53 1502.46 1516.52 1537.09 1541.35 1613.65 1680.82 1722.63 1795.72 1800.59 1851.57 2763.19 3004.74 3097.96 3100.57 3102.42 3110.51 3121.46 3124.66 3156.07 3161.21 3173.85 3187.18 3384.24 3442.36 3594.31 3640.95 3784.70 3790.84
frequency: 24.56 38.77 47.25 50.89 65.31 74.41 85.62 96.64 127.62 140.32 152.24 178.11 191.64 216.61 220.55 236.18 267.88 268.57 272.69 308.16 312.59 354.61 360.25 386.46 427.67 452.30 473.68 513.81 534.98 536.70 574.13 595.44 611.94 623.71 660.04 668.40 692.17 710.33 739.36 749.08 754.30 759.73 804.65 850.39 867.38 877.07 894.91 921.22 956.60 997.57 1023.58 1033.45 1060.99 1081.22 1128.57 1160.95 1166.20 1183.75 1184.55 1213.31 1216.01 1228.92 1260.67 1287.39 1300.54 1313.71 1321.05 1353.22 1360.39 1379.00 1384.54 1386.72 1422.19 1429.12 1437.17 1454.77 1467.69 1477.20 1492.17 1492.53 1502.46 1516.52 1537.09 1541.35 1613.65 1680.82 1722.63 1795.72 1800.59 1851.57 2763.19 3004.74 3097.96 3100.57 3102.42 3110.51 3121.46 3124.66 3156.07 3161.21 3173.85 3187.18 3384.24 3442.36 3594.31 3640.95 3784.70 3790.84
formula: C10H18N3O6S
InChI: InChI=1S/C10H18N3O6S/c11-5(10(18)19)1-2-7(14)13-6(4-20)9(17)12-3-8(15)16/h5-6,12-13,15,18,20H,1-4H2,11H3
38 atoms
N  -1.619183 0.206345 2.371026
H  -2.395279 0.378197 2.991488
C  -0.31287 0.57884 2.854945
H  0.260582 1.16792 2.143774
C  0.573436 -0.559161 3.330198
O  1.781755 -0.565755 3.199065
C  -2.032111 -0.489082 1.25976
C  -1.038824 -0.961245 0.180529
O  -3.205349 -0.755555 1.123784
N  0.024371 0.034787 -0.004151
H  -1.634997 -0.998924 -0.731977
C  -0.583829 -2.391429 0.492445
H  -0.331173 0.978523 -0.084232
H  -0.116512 -2.453577 1.475176
H  0.142079 -2.710756 -0.250136
O  -0.094455 -1.529578 3.935234
H  0.52925 -2.189661 4.269771
H  -0.463873 1.212375 3.733275
S  -1.889063 -3.629138 0.336122
H  -2.804354 -3.028117 1.103872
C  1.371004 0.04757 -0.012078
O  1.938824 1.148254 0.010749
C  2.188119 -1.231424 -0.087658
H  1.948202 -1.879473 0.754696
H  1.881495 -1.761707 -0.990876
C  3.698195 -0.992564 -0.159732
H  3.924561 -0.21029 -0.887057
H  4.171442 -1.908189 -0.51371
C  4.354388 -0.654775 1.181042
H  4.126491 -1.430875 1.914264
N  3.879316 0.6509 1.73166
H  4.701376 1.217701 1.967922
H  3.277046 1.114987 1.011078
C  5.873195 -0.540342 1.076016
O  6.469897 0.447256 1.416561
O  6.421532 -1.645207 0.590026
H  7.382578 -1.531897 0.553481
H  3.274802 0.493903 2.54351
totalener: -1406.22453324 hartree
nucrepener: 1871.23411611 hartree
electener: -3277.45864935 hartree
oneelecener: -5625.07429215 hartree
twoeener: 2347.61564281 hartree
kineticenergy: 1400.64053481 hartree
exchangeener: -105.323162521751 hartree
correlationener: -7.056650130620 hartree
xcener: -112.379812652371 hartree
temp: 298.15 k
press: 1.00 atm
thermalcorrenthalpy: 0.00094421 hartree
totalenthalpy: -1405.97669531 hartree
totalentropycorr: -0.06525367 hartree
gibbsenthalpy: -1406.04194898 hartree
gibbsminuselec: 0.26438327 hartree
chargesum: 1.0000000
charge: -0.199635 0.197903 -0.070501 0.108569 0.320292 -0.400331 0.170421 0.046091 -0.296147 -0.215901 0.164863 -0.203747 0.192774 0.102104 0.127494 -0.218181 0.243211 0.151193 -0.115873 0.130491 0.259874 -0.404248 -0.188194 0.112519 0.153487 -0.233010 0.144722 0.139304 0.019523 0.137769 -0.070497 0.222305 0.228003 0.295275 -0.296745 -0.244814 0.255696 0.233942
charge: 0.320663 -0.005091 -0.055655 0.026072 -0.428613 0.091905 -0.386533 -0.123100 0.122230 0.344603 0.046761 -0.257118 0.004161 -0.007108 0.006303 0.408966 -0.070826 0.050822 0.512876 -0.140677 -0.358244 0.098994 -0.010697 0.030179 0.042877 0.004677 0.039061 0.042791 -0.049691 0.044049 0.609609 0.022721 -0.032644 -0.429201 0.141894 0.401505 -0.062649 0.004131
qa: -0.1996 0.1979 -0.0705 0.1086 0.3203 -0.4003 0.1704 0.0461 -0.2961 -0.2159 0.1649 -0.2037 0.1928 0.1021 0.1275 -0.2182 0.2432 0.1512 -0.1159 0.1305 0.2599 -0.4042 -0.1882 0.1125 0.1535 -0.2330 0.1447 0.1393 0.0195 0.1378 -0.0705 0.2223 0.2280 0.2953 -0.2967 -0.2448 0.2557 0.2339
va: 3.0834 1.0136 3.8746 1.0314 4.1822 2.0554 4.3447 3.6149 2.2162 3.1776 1.0186 4.0488 1.0079 1.0243 0.9915 2.2885 1.0133 0.9927 2.1916 1.0330 4.1487 2.0736 3.8123 1.0141 0.9926 3.8951 1.0094 1.0190 3.8617 1.0175 3.5668 1.0160 1.0685 4.3424 2.1955 2.2661 1.0043 1.0192
dispcorr: -0.082632940 hartree
energy: -1406.312112759781
dipole: 5.41126 -2.44662 2.96464 1.13586 -0.57778 0.55808 -0.77474 1.86918 1.09444
magnitude: 3.20910 au
magnitude: 8.15689 debye
zeropoint: 0.31149550 hartree
thermalvibcorrection: 0.01824209 hartree
thermalrotcorrection: 0.00141627 hartree
thermaltrasncorrection: 0.00141627 hartree
thermaltotal: -1405.97954263 hartree
thermalcorr: 0.02107463 hartree
nonthermalcorr: 0.31149550 hartree
totalcorr: 0.33257013 hartree
totalenthalpy: -1405.97859842 hartree
