program: Orca
programVersion: 5.0.2
elementType: N H C H C O C C O N H C H H H O H H S H C O C H H C H H C H N H H C O O H H
charge: 1
multiplicity: 1
keywords: wB97X-D3BJ Opt Freq def2-TZVPP def2/J RIJCOSX VeryTightSCF
keywords: PAL8 defgrid3 TightOpt
frequency: 0.00 0.00 0.00 0.00 0.00 0.00 26.88 32.09 43.66 50.71 60.75 63.02 84.02 109.04 111.51 133.08 144.53 159.34 171.62 199.77 232.30 255.43 264.51 272.58 285.37 297.24 352.33 360.34 364.85 408.81 436.90 460.23 500.71 526.80 530.37 539.39 554.74 569.80 592.32 617.37 644.00 659.48 673.07 740.37 742.85 755.84 776.51 785.41 805.72 843.64 855.94 880.97 898.13 912.43 936.38 992.77 1010.89 1023.60 1035.48 1120.93 1125.42 1133.88 1168.04 1170.02 1183.09 1191.59 1201.06 1234.79 1260.32 1280.41 1290.75 1293.90 1326.49 1334.16 1339.18 1352.37 1389.14 1393.33 1419.69 1429.09 1443.17 1455.84 1466.37 1474.27 1483.05 1484.72 1498.32 1520.15 1525.89 1559.63 1625.80 1698.83 1706.79 1752.46 1843.83 1889.13 2754.63 3092.05 3098.60 3111.49 3117.37 3120.60 3129.73 3148.85 3165.61 3172.20 3179.01 3184.15 3327.24 3556.24 3587.43 3622.12 3792.13 3798.43
frequency: 26.88 32.09 43.66 50.71 60.75 63.02 84.02 109.04 111.51 133.08 144.53 159.34 171.62 199.77 232.30 255.43 264.51 272.58 285.37 297.24 352.33 360.34 364.85 408.81 436.90 460.23 500.71 526.80 530.37 539.39 554.74 569.80 592.32 617.37 644.00 659.48 673.07 740.37 742.85 755.84 776.51 785.41 805.72 843.64 855.94 880.97 898.13 912.43 936.38 992.77 1010.89 1023.60 1035.48 1120.93 1125.42 1133.88 1168.04 1170.02 1183.09 1191.59 1201.06 1234.79 1260.32 1280.41 1290.75 1293.90 1326.49 1334.16 1339.18 1352.37 1389.14 1393.33 1419.69 1429.09 1443.17 1455.84 1466.37 1474.27 1483.05 1484.72 1498.32 1520.15 1525.89 1559.63 1625.80 1698.83 1706.79 1752.46 1843.83 1889.13 2754.63 3092.05 3098.60 3111.49 3117.37 3120.60 3129.73 3148.85 3165.61 3172.20 3179.01 3184.15 3327.24 3556.24 3587.43 3622.12 3792.13 3798.43
formula: C10H18N3O6S
InChI: InChI=1S/C10H18N3O6S/c11-5(10(18)19)1-2-7(14)13-6(4-20)9(17)12-3-8(15)16/h5-6,12-13,15,18,20H,1-4H2,11H3
38 atoms
N  -2.036977 -0.514011 -2.780124
H  -1.843563 -0.357899 -3.758851
C  -3.308486 -0.002165 -2.314609
H  -3.958009 0.131242 -3.178647
C  -3.165466 1.329422 -1.593418
O  -2.121094 1.767644 -1.183287
C  -0.901487 -0.72185 -2.085674
C  -0.84223 -1.021412 -0.571248
O  0.176165 -0.74515 -2.689908
N  0.00419 -0.005231 0.019759
H  -0.312605 -1.971194 -0.540837
C  -2.11591 -1.22724 0.246109
H  -0.385724 0.929325 0.000893
H  -2.628897 -0.284797 0.428785
H  -2.799704 -1.903086 -0.263581
O  -4.346107 1.92256 -1.444906
H  -4.224708 2.74932 -0.956812
H  -3.825234 -0.693896 -1.650642
S  -1.739624 -1.906676 1.882965
H  -1.727565 -3.193139 1.515623
C  1.35909 -0.01354 -0.001954
O  1.986222 1.042612 0.024248
C  2.096314 -1.344597 -0.024967
H  2.133481 -1.689394 1.011883
H  1.567894 -2.109724 -0.587857
C  3.517766 -1.194672 -0.559073
H  4.072387 -2.1133 -0.370262
H  4.024386 -0.383946 -0.035775
C  3.604698 -0.943078 -2.060624
H  4.636449 -0.701489 -2.325822
N  2.762989 0.229876 -2.488961
H  1.767961 -0.064855 -2.595144
H  2.777221 0.945695 -1.747852
C  3.207045 -2.155559 -2.902372
O  3.126689 -3.271269 -2.484678
O  3.000724 -1.792475 -4.179563
H  2.768915 -2.579336 -4.692065
H  3.075959 0.606358 -3.380302
totalener: -1406.23663644 hartree
nucrepener: 1890.76323478 hartree
electener: -3296.99987122 hartree
oneelecener: -5665.48740728 hartree
twoeener: 2368.48753606 hartree
kineticenergy: 1400.66684919 hartree
exchangeener: -105.327171155770 hartree
correlationener: -7.055454533588 hartree
xcener: -112.382625689359 hartree
temp: 298.15 k
press: 1.00 atm
thermalcorrenthalpy: 0.00094421 hartree
totalenthalpy: -1405.98858640 hartree
totalentropycorr: -0.06544066 hartree
gibbsenthalpy: -1406.05402706 hartree
gibbsminuselec: 0.26456256 hartree
chargesum: 1.0000000
charge: -0.158940 0.189637 -0.094330 0.159086 0.308932 -0.334502 0.264723 0.051081 -0.459443 -0.147418 0.112776 -0.202221 0.199175 0.127234 0.133953 -0.241403 0.250223 0.135385 -0.120480 0.106857 0.155642 -0.382661 -0.161192 0.140224 0.107673 -0.174456 0.131752 0.144039 0.000036 0.158641 -0.074264 0.232796 0.234263 0.261939 -0.253147 -0.283311 0.251131 0.230571
charge: 0.342960 -0.000626 -0.039680 0.045737 -0.443909 0.117426 -0.329774 -0.150415 0.081677 0.342009 0.037888 -0.248781 -0.009542 0.008399 0.006287 0.394378 -0.070699 0.034617 0.506212 -0.147990 -0.374047 0.073199 -0.002276 0.048611 0.021946 0.004748 0.045036 0.035434 -0.048483 0.048124 0.607961 -0.017881 0.023486 -0.437655 0.162902 0.364590 -0.072266 0.040398
qa: -0.1589 0.1896 -0.0943 0.1591 0.3089 -0.3345 0.2647 0.0511 -0.4594 -0.1474 0.1128 -0.2022 0.1992 0.1272 0.1340 -0.2414 0.2502 0.1354 -0.1205 0.1069 0.1556 -0.3827 -0.1612 0.1402 0.1077 -0.1745 0.1318 0.1440 0.0000 0.1586 -0.0743 0.2328 0.2343 0.2619 -0.2531 -0.2833 0.2511 0.2306
va: 3.2013 1.0157 3.8469 1.0016 4.2676 2.1350 4.2351 3.7666 2.0339 3.1321 1.0312 3.9580 1.0259 1.0115 1.0008 2.2674 1.0086 1.0023 2.1619 1.0226 4.3271 2.0914 3.8018 1.0113 1.0213 3.9135 1.0165 1.0121 3.8294 0.9992 3.6029 1.0669 1.0202 4.3695 2.2369 2.2099 1.0117 0.9785
dispcorr: -0.082488940 hartree
energy: -1406.323893862085
dipole: 3.22041 -3.04034 0.18008 -1.80508 2.19432 0.38924 -1.58289 -0.80220 -2.38509
magnitude: 2.42334 au
magnitude: 6.15965 debye
zeropoint: 0.31167543 hartree
thermalvibcorrection: 0.01829649 hartree
thermalrotcorrection: 0.00141627 hartree
thermaltrasncorrection: 0.00141627 hartree
thermaltotal: -1405.99108939 hartree
thermalcorr: 0.02112904 hartree
nonthermalcorr: 0.31167543 hartree
totalcorr: 0.33280447 hartree
totalenthalpy: -1405.99014518 hartree
