program: Orca
programVersion: 5.0.2
elementType: N H C H C O C C O N H C H H H O H H S H C O C H H C H H C H N H H C O O H H
charge: 1
multiplicity: 1
keywords: wB97X-D3BJ Opt Freq def2-TZVPP def2/J RIJCOSX VeryTightSCF
keywords: PAL8 defgrid3 TightOpt
frequency: 0.00 0.00 0.00 0.00 0.00 0.00 29.45 30.91 40.97 47.55 58.49 76.14 80.85 104.02 121.11 126.85 135.79 157.57 183.85 213.41 226.95 250.77 263.15 276.23 294.52 297.08 317.26 351.33 370.34 407.19 446.42 464.81 505.18 511.20 523.00 525.80 561.70 582.79 603.60 607.39 620.09 661.45 664.64 698.32 719.07 741.41 753.41 766.42 796.01 841.59 845.40 885.42 913.68 935.94 957.11 981.15 990.72 1023.93 1049.89 1095.23 1122.58 1147.45 1161.79 1165.04 1178.89 1206.46 1215.33 1228.45 1241.74 1265.41 1287.43 1299.96 1316.42 1321.97 1356.66 1364.29 1374.83 1380.38 1415.52 1421.83 1426.15 1459.06 1466.50 1471.86 1476.17 1479.81 1496.04 1516.47 1537.15 1567.65 1627.48 1676.14 1730.84 1813.67 1825.55 1858.23 2750.80 2796.80 3079.25 3101.29 3112.56 3125.51 3134.70 3138.73 3158.20 3162.31 3165.59 3184.70 3357.58 3564.06 3603.67 3644.38 3790.17 3800.26
frequency: 29.45 30.91 40.97 47.55 58.49 76.14 80.85 104.02 121.11 126.85 135.79 157.57 183.85 213.41 226.95 250.77 263.15 276.23 294.52 297.08 317.26 351.33 370.34 407.19 446.42 464.81 505.18 511.20 523.00 525.80 561.70 582.79 603.60 607.39 620.09 661.45 664.64 698.32 719.07 741.41 753.41 766.42 796.01 841.59 845.40 885.42 913.68 935.94 957.11 981.15 990.72 1023.93 1049.89 1095.23 1122.58 1147.45 1161.79 1165.04 1178.89 1206.46 1215.33 1228.45 1241.74 1265.41 1287.43 1299.96 1316.42 1321.97 1356.66 1364.29 1374.83 1380.38 1415.52 1421.83 1426.15 1459.06 1466.50 1471.86 1476.17 1479.81 1496.04 1516.47 1537.15 1567.65 1627.48 1676.14 1730.84 1813.67 1825.55 1858.23 2750.80 2796.80 3079.25 3101.29 3112.56 3125.51 3134.70 3138.73 3158.20 3162.31 3165.59 3184.70 3357.58 3564.06 3603.67 3644.38 3790.17 3800.26
formula: C10H18N3O6S
InChI: InChI=1S/C10H18N3O6S/c11-5(10(18)19)1-2-7(14)13-6(4-20)9(17)12-3-8(15)16/h5-6,12-13,15,18,20H,1-4H2,11H3
38 atoms
N  -2.053764 -0.696206 -2.125976
H  -2.870516 -0.374485 -2.62216
C  -0.825025 -0.828234 -2.860495
H  -0.195353 -1.618113 -2.45549
C  0.024541 0.430408 -2.962229
O  1.226171 0.409757 -3.097925
C  -2.216782 -0.719922 -0.770057
C  -0.98837 -1.07968 0.093247
O  -3.280002 -0.464255 -0.252975
N  -0.046572 0.031168 0.010573
H  -0.511434 -1.970673 -0.314719
C  -1.436362 -1.341563 1.530533
H  -0.423312 0.954614 0.179512
H  -1.869653 -0.432346 1.945373
H  -2.222635 -2.092534 1.547315
O  -0.694284 1.547794 -2.925454
H  -0.101444 2.303386 -3.039057
H  -1.057538 -1.125406 -3.886273
S  -0.084845 -1.831216 2.628863
H  -0.135408 -3.144698 2.377729
C  1.290664 0.008663 -0.110071
O  1.920575 1.073552 -0.099312
C  1.995932 -1.322889 -0.302408
H  1.570382 -2.038532 0.39857
H  1.78014 -1.684265 -1.313048
C  3.505433 -1.227523 -0.053559
H  3.887825 -2.208338 0.228033
H  3.693937 -0.557826 0.785874
C  4.342033 -0.760562 -1.253296
H  5.367904 -0.593101 -0.925087
N  3.808201 0.509779 -1.829183
H  4.546821 1.146132 -2.114968
H  3.230658 0.292303 -2.654016
C  4.357646 -1.790157 -2.377541
O  3.84338 -1.601605 -3.446923
O  4.989465 -2.900031 -2.007752
H  4.983919 -3.526699 -2.745448
H  3.162764 0.95829 -1.117611
totalener: -1406.24121676 hartree
nucrepener: 1914.77257291 hartree
electener: -3321.01378967 hartree
oneelecener: -5712.89817276 hartree
twoeener: 2391.88438310 hartree
kineticenergy: 1400.65782917 hartree
exchangeener: -105.325366313841 hartree
correlationener: -7.056789571782 hartree
xcener: -112.382155885623 hartree
temp: 298.15 k
press: 1.00 atm
thermalcorrenthalpy: 0.00094421 hartree
totalenthalpy: -1405.99552200 hartree
totalentropycorr: -0.06524085 hartree
gibbsenthalpy: -1406.06076286 hartree
gibbsminuselec: 0.26360833 hartree
chargesum: 1.0000000
charge: -0.182467 0.201450 -0.112977 0.115842 0.355898 -0.384681 0.193155 -0.049932 -0.295035 -0.167274 0.121203 -0.117888 0.199705 0.130956 0.138527 -0.237037 0.238513 0.149613 -0.140515 0.105229 0.220169 -0.390357 -0.135452 0.108751 0.108239 -0.214689 0.139223 0.147538 0.009567 0.158511 -0.073167 0.223621 0.237079 0.250346 -0.281730 -0.245971 0.254002 0.222032
charge: 0.326550 -0.005501 -0.053451 0.028681 -0.433475 0.093093 -0.380341 -0.141870 0.125865 0.358065 0.028523 -0.236031 0.005058 0.019453 0.019438 0.394529 -0.075490 0.048504 0.501107 -0.150817 -0.355303 0.118520 -0.015101 0.020462 0.029327 0.009262 0.042075 0.039384 -0.051770 0.046222 0.606016 0.037418 0.020432 -0.444340 0.140687 0.396450 -0.067071 -0.044558
qa: -0.1825 0.2015 -0.1130 0.1158 0.3559 -0.3847 0.1932 -0.0499 -0.2950 -0.1673 0.1212 -0.1179 0.1997 0.1310 0.1385 -0.2370 0.2385 0.1496 -0.1405 0.1052 0.2202 -0.3904 -0.1355 0.1088 0.1082 -0.2147 0.1392 0.1475 0.0096 0.1585 -0.0732 0.2236 0.2371 0.2503 -0.2817 -0.2460 0.2540 0.2220
va: 3.1300 1.0093 3.9374 1.0044 4.2037 2.0870 4.3513 3.8431 2.2219 3.1099 0.9956 3.9932 1.0123 1.0174 1.0124 2.2806 1.0200 0.9948 2.1833 1.0203 4.1958 2.1020 3.6947 1.0798 1.0272 3.8821 1.0153 1.0107 3.8707 1.0011 3.5913 0.9804 1.0206 4.3842 2.2046 2.2616 1.0048 1.0888
dispcorr: -0.083351868 hartree
energy: -1406.330329948607
dipole: 5.43501 -2.52158 2.91343 -3.08949 2.90192 -0.18757 0.65313 -2.18604 -1.53291
magnitude: 3.29743 au
magnitude: 8.38141 debye
zeropoint: 0.31052856 hartree
thermalvibcorrection: 0.01837148 hartree
thermalrotcorrection: 0.00141627 hartree
thermaltrasncorrection: 0.00141627 hartree
thermaltotal: -1405.99859736 hartree
thermalcorr: 0.02120402 hartree
nonthermalcorr: 0.31052856 hartree
totalcorr: 0.33173258 hartree
totalenthalpy: -1405.99765316 hartree
