program: Orca
programVersion: 5.0.2
elementType: N H C H C O C C O N H C H H H O H H S H C O C H H C H H C H N H H C O O H H
charge: 1
multiplicity: 1
keywords: wB97X-D3BJ Opt Freq def2-TZVPP def2/J RIJCOSX VeryTightSCF
keywords: PAL8 defgrid3 TightOpt
frequency: 0.00 0.00 0.00 0.00 0.00 0.00 23.93 27.09 39.49 52.00 56.15 71.74 83.31 91.42 102.28 126.14 134.02 150.80 180.91 195.37 205.15 212.27 251.08 265.60 273.03 282.72 314.95 322.36 358.59 397.76 410.82 431.53 503.26 510.27 517.96 533.44 562.01 599.45 614.76 646.89 657.04 664.67 686.57 696.02 713.18 726.82 754.66 785.78 796.97 818.76 854.83 899.38 915.88 929.85 959.07 996.12 1027.43 1029.56 1061.59 1083.14 1106.34 1133.60 1167.23 1176.34 1181.42 1210.05 1213.36 1250.12 1256.95 1263.73 1272.71 1279.24 1315.87 1320.43 1329.77 1330.99 1367.30 1389.79 1409.17 1433.05 1458.78 1466.40 1469.66 1479.20 1496.76 1501.04 1503.89 1519.87 1540.93 1543.26 1652.17 1675.33 1738.50 1810.24 1845.04 1862.93 2759.32 3022.24 3079.26 3095.87 3103.40 3117.92 3120.48 3123.15 3127.70 3173.34 3174.70 3191.59 3352.99 3537.03 3572.13 3635.56 3785.10 3794.98
frequency: 23.93 27.09 39.49 52.00 56.15 71.74 83.31 91.42 102.28 126.14 134.02 150.80 180.91 195.37 205.15 212.27 251.08 265.60 273.03 282.72 314.95 322.36 358.59 397.76 410.82 431.53 503.26 510.27 517.96 533.44 562.01 599.45 614.76 646.89 657.04 664.67 686.57 696.02 713.18 726.82 754.66 785.78 796.97 818.76 854.83 899.38 915.88 929.85 959.07 996.12 1027.43 1029.56 1061.59 1083.14 1106.34 1133.60 1167.23 1176.34 1181.42 1210.05 1213.36 1250.12 1256.95 1263.73 1272.71 1279.24 1315.87 1320.43 1329.77 1330.99 1367.30 1389.79 1409.17 1433.05 1458.78 1466.40 1469.66 1479.20 1496.76 1501.04 1503.89 1519.87 1540.93 1543.26 1652.17 1675.33 1738.50 1810.24 1845.04 1862.93 2759.32 3022.24 3079.26 3095.87 3103.40 3117.92 3120.48 3123.15 3127.70 3173.34 3174.70 3191.59 3352.99 3537.03 3572.13 3635.56 3785.10 3794.98
formula: C10H18N3O6S
InChI: InChI=1S/C10H18N3O6S/c11-5(10(18)19)1-2-7(14)13-6(4-20)9(17)12-3-8(15)16/h5-6,12-13,15,18,20H,1-4H2,11H3
38 atoms
N  -1.854702 -1.893115 2.555814
H  -1.726377 -2.235305 3.501288
C  -3.231977 -1.829812 2.113866
H  -3.586277 -0.802099 1.996617
C  -4.092366 -2.503508 3.169541
O  -3.653351 -2.978895 4.180857
C  -0.758047 -1.515553 1.890988
C  -0.946304 -1.040332 0.443988
O  0.356228 -1.566354 2.414278
N  0.00474 -0.019753 0.059488
H  -1.910515 -0.534477 0.394502
C  -1.047056 -2.241322 -0.545321
H  -0.335324 0.929134 0.098402
H  -2.068004 -2.339313 -0.909142
H  -0.432729 -2.015936 -1.415458
O  -5.376133 -2.487311 2.816981
H  -5.89513 -2.911064 3.515072
H  -3.392457 -2.350731 1.166984
S  -0.507676 -3.884567 0.004149
H  -1.526991 -4.158124 0.825666
C  1.379156 -0.049952 0.008934
O  2.011914 0.981034 -0.046213
C  2.091121 -1.386094 -0.022451
H  1.401466 -2.207053 0.146476
H  2.507847 -1.506792 -1.025426
C  3.21642 -1.391457 1.02065
H  2.928847 -0.790095 1.885787
H  4.121103 -0.94573 0.613156
C  3.527896 -2.808069 1.490886
H  3.776946 -3.453666 0.64627
N  2.342097 -3.39613 2.202168
H  2.681319 -3.750629 3.10726
H  1.599084 -2.677028 2.364366
C  4.677685 -2.87323 2.491624
O  4.54342 -3.342894 3.592951
O  5.796199 -2.372074 1.994588
H  6.497945 -2.436473 2.658824
H  1.901001 -4.146338 1.674124
totalener: -1406.22935948 hartree
nucrepener: 1837.19103371 hartree
electener: -3243.42039319 hartree
oneelecener: -5557.48970435 hartree
twoeener: 2314.06931116 hartree
kineticenergy: 1400.64789048 hartree
exchangeener: -105.321802889187 hartree
correlationener: -7.054509636547 hartree
xcener: -112.376312525734 hartree
temp: 298.15 k
press: 1.00 atm
thermalcorrenthalpy: 0.00094421 hartree
totalenthalpy: -1405.98115529 hartree
totalentropycorr: -0.06622993 hartree
gibbsenthalpy: -1406.04738523 hartree
gibbsminuselec: 0.26314944 hartree
chargesum: 1.0000000
charge: -0.134816 0.201008 -0.115522 0.150939 0.290828 -0.300634 0.202018 0.084084 -0.432346 -0.206520 0.127416 -0.209208 0.183770 0.151244 0.154182 -0.252327 0.250840 0.130775 -0.145433 0.115944 0.209545 -0.313367 -0.106546 -0.015278 0.139810 -0.230087 0.134194 0.146366 0.030604 0.145875 -0.067789 0.222690 0.226856 0.298156 -0.303361 -0.237938 0.256604 0.217423
charge: 0.349421 -0.004534 -0.041900 0.036490 -0.436870 0.131731 -0.372966 -0.138127 0.106779 0.323077 0.038736 -0.225566 -0.010188 0.007786 0.020092 0.386341 -0.070560 0.030138 0.500438 -0.149665 -0.378547 0.113717 -0.013872 -0.006267 0.039312 0.002130 0.040268 0.043619 -0.046780 0.045598 0.607848 0.025530 -0.034156 -0.428755 0.138616 0.409284 -0.061755 0.023557
qa: -0.1348 0.2010 -0.1155 0.1509 0.2908 -0.3006 0.2020 0.0841 -0.4323 -0.2065 0.1274 -0.2092 0.1838 0.1512 0.1542 -0.2523 0.2508 0.1308 -0.1454 0.1159 0.2095 -0.3134 -0.1065 -0.0153 0.1398 -0.2301 0.1342 0.1464 0.0306 0.1459 -0.0678 0.2227 0.2269 0.2982 -0.3034 -0.2379 0.2566 0.2174
va: 3.1573 1.0323 3.8530 0.9966 4.3672 2.1907 4.2504 3.7345 2.0573 3.1111 0.9941 3.8784 1.0197 0.9940 1.0095 2.2469 1.0081 0.9918 2.1813 1.0218 4.3510 2.2194 3.7560 1.1020 1.0162 3.8920 1.0212 1.0268 3.8201 1.0050 3.5841 1.0203 1.0881 4.3378 2.1893 2.2804 1.0036 1.0052
dispcorr: -0.081624405 hartree
energy: -1406.316058206987
dipole: -0.05799 -0.29583 -0.35382 -0.97034 -0.69953 -1.66987 -5.85269 5.61658 -0.23611
magnitude: 1.72320 au
magnitude: 4.38002 debye
zeropoint: 0.31061476 hartree
thermalvibcorrection: 0.01871837 hartree
thermalrotcorrection: 0.00141627 hartree
thermaltrasncorrection: 0.00141627 hartree
thermaltotal: -1405.98389253 hartree
thermalcorr: 0.02155092 hartree
nonthermalcorr: 0.31061476 hartree
totalcorr: 0.33216568 hartree
totalenthalpy: -1405.98294832 hartree
