program: Orca
programVersion: 5.0.2
elementType: N H C H C O C C O N H C H H H O H H S H C O C H H C H H C H N H H C O O H H
charge: 1
multiplicity: 1
keywords: wB97X-D3BJ Opt Freq def2-TZVPP def2/J RIJCOSX VeryTightSCF
keywords: PAL8 defgrid3 TightOpt
frequency: 0.00 0.00 0.00 0.00 0.00 0.00 31.53 39.99 42.08 50.47 58.86 68.13 75.58 93.96 98.24 122.32 159.37 183.22 201.06 213.51 230.37 238.73 285.14 296.27 303.15 320.54 347.17 349.90 383.72 413.23 429.99 483.03 490.99 514.92 527.51 545.89 564.78 599.10 602.17 612.95 640.79 655.93 674.43 696.83 728.10 750.69 761.31 777.41 788.87 827.58 863.32 869.97 887.76 914.70 937.28 996.96 1010.73 1029.54 1044.18 1057.10 1113.48 1142.00 1160.28 1161.35 1180.52 1195.22 1232.28 1246.07 1256.09 1283.13 1297.34 1301.33 1326.08 1341.41 1342.62 1353.43 1371.25 1385.35 1397.21 1432.07 1446.19 1449.96 1468.23 1476.96 1484.39 1488.75 1493.78 1524.24 1537.65 1547.45 1621.95 1672.35 1717.10 1774.53 1852.86 1878.85 2511.51 2749.48 3090.28 3095.38 3109.32 3112.24 3126.56 3143.51 3154.81 3163.24 3166.48 3171.32 3507.08 3555.34 3577.84 3637.21 3661.77 3799.41
frequency: 31.53 39.99 42.08 50.47 58.86 68.13 75.58 93.96 98.24 122.32 159.37 183.22 201.06 213.51 230.37 238.73 285.14 296.27 303.15 320.54 347.17 349.90 383.72 413.23 429.99 483.03 490.99 514.92 527.51 545.89 564.78 599.10 602.17 612.95 640.79 655.93 674.43 696.83 728.10 750.69 761.31 777.41 788.87 827.58 863.32 869.97 887.76 914.70 937.28 996.96 1010.73 1029.54 1044.18 1057.10 1113.48 1142.00 1160.28 1161.35 1180.52 1195.22 1232.28 1246.07 1256.09 1283.13 1297.34 1301.33 1326.08 1341.41 1342.62 1353.43 1371.25 1385.35 1397.21 1432.07 1446.19 1449.96 1468.23 1476.96 1484.39 1488.75 1493.78 1524.24 1537.65 1547.45 1621.95 1672.35 1717.10 1774.53 1852.86 1878.85 2511.51 2749.48 3090.28 3095.38 3109.32 3112.24 3126.56 3143.51 3154.81 3163.24 3166.48 3171.32 3507.08 3555.34 3577.84 3637.21 3661.77 3799.41
formula: C10H18N3O6S
InChI: InChI=1S/C10H18N3O6S/c11-5(10(18)19)1-2-7(14)13-6(4-20)9(17)12-3-8(15)16/h5-6,12-13,15,18,20H,1-4H2,11H3
38 atoms
N  -0.307402 -2.74554 -2.444629
H  0.014078 -2.81845 -3.398085
C  -0.752803 -3.963299 -1.811353
H  -1.574884 -3.784181 -1.115872
C  0.341383 -4.686727 -1.037824
O  1.361569 -4.176943 -0.656093
C  0.004238 -1.560803 -1.870176
C  -0.395476 -1.340568 -0.399109
O  0.534261 -0.667776 -2.512292
N  0.299827 -0.200703 0.156809
H  -0.151238 -2.23419 0.176757
C  -1.912136 -1.09424 -0.295549
H  -0.185955 0.684329 0.064164
H  -2.461484 -1.902839 -0.772719
H  -2.195294 -1.077248 0.757363
O  -0.006084 -5.952848 -0.802478
H  0.69178 -6.375355 -0.283018
H  -1.148073 -4.632582 -2.574358
S  -2.465166 0.493703 -0.959259
H  -2.075535 0.293387 -2.224659
C  1.610938 -0.098164 0.404369
O  2.100892 1.011527 0.670435
C  2.443669 -1.360434 0.39189
H  2.16813 -1.937756 1.279204
H  2.168669 -1.991402 -0.451601
C  3.961117 -1.147362 0.399356
H  4.426143 -2.130241 0.332639
H  4.288543 -0.70191 1.341935
C  4.513808 -0.300252 -0.763295
H  5.557756 -0.548794 -0.950464
N  4.428428 1.155367 -0.406471
H  3.483495 1.272975 0.102098
H  5.186893 1.42437 0.215073
C  3.711519 -0.597378 -2.026578
O  3.688286 -1.689953 -2.511786
O  3.008513 0.461921 -2.432871
H  2.263613 0.159142 -2.984316
H  4.441723 1.750216 -1.232559
totalener: -1406.24756508 hartree
nucrepener: 1943.35090219 hartree
electener: -3349.59846727 hartree
oneelecener: -5770.70855070 hartree
twoeener: 2421.11008343 hartree
kineticenergy: 1401.49562929 hartree
exchangeener: -105.478006699495 hartree
correlationener: -7.068642442840 hartree
xcener: -112.546649142336 hartree
temp: 298.15 k
press: 1.00 atm
thermalcorrenthalpy: 0.00094421 hartree
totalenthalpy: -1406.00018808 hartree
totalentropycorr: -0.06700186 hartree
gibbsenthalpy: -1406.06718994 hartree
gibbsminuselec: 0.26457970 hartree
chargesum: 1.0000000
charge: -0.163845 0.196353 -0.102026 0.117418 0.307267 -0.327402 0.172826 0.045934 -0.400722 -0.121424 0.121063 -0.165988 0.179496 0.120944 0.148896 -0.247155 0.244874 0.157358 -0.124511 0.118038 0.225752 -0.394323 -0.143351 0.141813 0.126941 -0.241599 0.140691 0.123478 -0.013168 0.165264 -0.068406 0.228539 0.215601 0.271201 -0.253859 -0.291050 0.269161 0.219921
charge: 0.342273 -0.001511 -0.047946 0.033133 -0.441752 0.117438 -0.383301 -0.136405 0.083885 0.357891 0.035155 -0.233578 -0.021325 0.004813 0.019052 0.385317 -0.075875 0.044885 0.520341 -0.142153 -0.333194 0.141275 -0.005564 0.047652 0.029733 0.012256 0.046691 0.032087 -0.046823 0.042342 0.592260 -0.070411 0.035399 -0.456642 0.159881 0.370770 -0.091802 0.033751
qa: -0.1638 0.1964 -0.1020 0.1174 0.3073 -0.3274 0.1728 0.0459 -0.4007 -0.1214 0.1211 -0.1660 0.1795 0.1209 0.1489 -0.2472 0.2449 0.1574 -0.1245 0.1180 0.2258 -0.3943 -0.1434 0.1418 0.1269 -0.2416 0.1407 0.1235 -0.0132 0.1653 -0.0684 0.2285 0.2156 0.2712 -0.2539 -0.2910 0.2692 0.2199
va: 3.1440 1.0115 3.8463 1.0101 4.2596 2.1258 4.3260 3.8205 2.0945 3.1993 1.0092 3.9416 1.0603 1.0117 0.9977 2.2520 1.0132 1.0058 2.1913 1.0249 4.2461 2.1106 3.7491 1.0006 1.0341 3.9782 1.0055 1.0074 3.7749 0.9952 3.5660 1.0975 0.9839 4.4042 2.2721 2.2073 1.0241 0.9935
dispcorr: -0.084015030 hartree
energy: -1406.333654469583
dipole: 4.82769 -2.77015 2.05754 -0.98247 0.97185 -0.01062 5.20392 -4.33213 0.87180
magnitude: 2.23464 au
magnitude: 5.67999 debye
zeropoint: 0.31023607 hartree
thermalvibcorrection: 0.01815651 hartree
thermalrotcorrection: 0.00141627 hartree
thermaltrasncorrection: 0.00141627 hartree
thermaltotal: -1406.00242935 hartree
thermalcorr: 0.02098905 hartree
nonthermalcorr: 0.31023607 hartree
totalcorr: 0.33122512 hartree
totalenthalpy: -1406.00148514 hartree
