program: Orca
programVersion: 5.0.2
elementType: N H C H C O C C O N H C H H H O H H S H C O C H H C H H C H N H H C O O H H
charge: 1
multiplicity: 1
keywords: wB97X-D3BJ Opt Freq def2-TZVPP def2/J RIJCOSX VeryTightSCF
keywords: PAL8 defgrid3 TightOpt
frequency: 0.00 0.00 0.00 0.00 0.00 0.00 10.22 28.80 40.69 46.32 55.16 70.94 78.95 95.83 103.02 114.80 141.16 186.50 210.33 234.79 243.18 254.21 292.13 305.01 313.03 325.91 349.87 377.52 402.59 407.75 443.25 467.46 478.13 502.59 516.60 541.20 553.67 564.86 592.15 619.43 625.00 649.70 670.35 681.62 703.97 713.61 739.98 756.90 771.36 826.33 849.34 886.38 898.96 916.91 941.50 983.44 1010.98 1017.31 1043.34 1075.59 1127.93 1141.66 1153.69 1167.26 1174.17 1186.47 1210.27 1247.33 1255.84 1286.45 1298.36 1312.51 1316.29 1340.41 1344.06 1356.49 1360.69 1392.95 1404.98 1418.67 1428.67 1432.23 1461.60 1466.15 1474.99 1489.32 1491.68 1528.48 1541.24 1547.97 1619.79 1680.85 1708.18 1803.54 1885.17 1888.14 2386.24 2764.35 3069.81 3083.10 3091.94 3103.62 3119.02 3137.38 3145.51 3155.44 3165.45 3196.72 3505.71 3576.89 3614.48 3641.90 3789.90 3847.75
frequency: 10.22 28.80 40.69 46.32 55.16 70.94 78.95 95.83 103.02 114.80 141.16 186.50 210.33 234.79 243.18 254.21 292.13 305.01 313.03 325.91 349.87 377.52 402.59 407.75 443.25 467.46 478.13 502.59 516.60 541.20 553.67 564.86 592.15 619.43 625.00 649.70 670.35 681.62 703.97 713.61 739.98 756.90 771.36 826.33 849.34 886.38 898.96 916.91 941.50 983.44 1010.98 1017.31 1043.34 1075.59 1127.93 1141.66 1153.69 1167.26 1174.17 1186.47 1210.27 1247.33 1255.84 1286.45 1298.36 1312.51 1316.29 1340.41 1344.06 1356.49 1360.69 1392.95 1404.98 1418.67 1428.67 1432.23 1461.60 1466.15 1474.99 1489.32 1491.68 1528.48 1541.24 1547.97 1619.79 1680.85 1708.18 1803.54 1885.17 1888.14 2386.24 2764.35 3069.81 3083.10 3091.94 3103.62 3119.02 3137.38 3145.51 3155.44 3165.45 3196.72 3505.71 3576.89 3614.48 3641.90 3789.90 3847.75
formula: C10H18N3O6S
InChI: InChI=1S/C10H18N3O6S/c11-5(10(18)19)1-2-7(14)13-6(4-20)9(17)12-3-8(15)16/h5-6,12-13,15,18,20H,1-4H2,11H3
38 atoms
N  -0.737747 -2.584022 1.550959
H  -0.498888 -3.499389 1.900485
C  -1.092353 -1.57507 2.511742
H  -1.74243 -0.82207 2.063282
C  0.107971 -0.85883 3.137534
O  1.248881 -1.091144 2.860341
C  -0.656765 -2.48558 0.19328
C  -0.97184 -1.121216 -0.434648
O  -0.378143 -3.444263 -0.494366
N  -0.026933 -0.074457 -0.05713
H  -1.931407 -0.809476 -0.009334
C  -1.204946 -1.214713 -1.947802
H  -0.391655 0.866724 -0.10012
H  -1.908836 -2.020243 -2.14981
H  -1.669257 -0.283627 -2.277639
O  -0.202501 0.081046 4.042962
H  -1.151069 0.138764 4.199041
H  -1.670111 -2.038811 3.316588
S  0.248507 -1.410092 -2.997999
H  0.460945 -2.703471 -2.73268
C  1.322923 -0.076099 -0.033137
O  1.885163 1.030932 0.026691
C  2.086889 -1.376622 -0.027301
H  1.668092 -1.998859 0.759297
H  1.903399 -1.887439 -0.96971
C  3.586944 -1.270321 0.250091
H  3.970053 -2.289413 0.294084
H  3.759034 -0.828939 1.235276
C  4.440514 -0.523146 -0.783529
H  5.484245 -0.824472 -0.675864
N  4.363268 0.954051 -0.550366
H  3.324876 1.144615 -0.283646
H  4.962034 1.230724 0.223367
C  4.042672 -0.877958 -2.212324
O  3.89131 -2.005564 -2.574013
O  3.906775 0.207254 -2.992853
H  3.649957 -0.080631 -3.880527
H  4.620895 1.48149 -1.38218
totalener: -1406.22667560 hartree
nucrepener: 1931.63328779 hartree
electener: -3337.85996339 hartree
oneelecener: -5747.75136169 hartree
twoeener: 2409.89139830 hartree
kineticenergy: 1400.65674938 hartree
exchangeener: -105.322831981913 hartree
correlationener: -7.057011080888 hartree
xcener: -112.379843062802 hartree
temp: 298.15 k
press: 1.00 atm
thermalcorrenthalpy: 0.00094421 hartree
totalenthalpy: -1405.98254518 hartree
totalentropycorr: -0.06518834 hartree
gibbsenthalpy: -1406.04773352 hartree
gibbsminuselec: 0.26286876 hartree
chargesum: 1.0000000
charge: -0.178810 0.199027 -0.171585 0.113187 0.329570 -0.305972 0.189671 -0.005162 -0.315800 -0.164693 0.129617 -0.149396 0.187237 0.138739 0.124339 -0.213877 0.218303 0.169193 -0.177949 0.146529 0.233640 -0.393657 -0.124006 0.146499 0.139870 -0.269803 0.139757 0.132807 -0.005900 0.155261 -0.071217 0.224333 0.215470 0.279937 -0.251481 -0.283591 0.253270 0.216645
charge: 0.335834 -0.003963 -0.069134 0.028286 -0.442273 0.140106 -0.392838 -0.140052 0.112352 0.346393 0.037983 -0.239241 -0.003612 0.019613 0.011742 0.391977 -0.095545 0.038747 0.500034 -0.138281 -0.320147 0.164026 -0.011577 0.034588 0.020318 0.010712 0.048802 0.036989 -0.052071 0.047027 0.589516 -0.089309 0.035247 -0.439808 0.166088 0.365185 -0.068689 0.024975
qa: -0.1788 0.1990 -0.1716 0.1132 0.3296 -0.3060 0.1897 -0.0052 -0.3158 -0.1647 0.1296 -0.1494 0.1872 0.1387 0.1243 -0.2139 0.2183 0.1692 -0.1779 0.1465 0.2336 -0.3937 -0.1240 0.1465 0.1399 -0.2698 0.1398 0.1328 -0.0059 0.1553 -0.0712 0.2243 0.2155 0.2799 -0.2515 -0.2836 0.2533 0.2166
va: 3.1512 1.0106 3.8760 1.0023 4.2745 2.1730 4.3193 3.7699 2.1931 3.0952 0.9894 4.0132 1.0156 1.0099 1.0028 2.2572 1.0222 0.9851 2.1805 1.0186 4.2475 2.1151 3.6266 1.0427 1.0662 3.9818 1.0031 1.0139 3.7903 0.9994 3.5249 1.1064 0.9850 4.3838 2.2615 2.1980 1.0097 1.0008
dispcorr: -0.084463729 hartree
energy: -1406.315941985808
dipole: 0.29733 0.39224 0.68957 2.43201 -0.26273 2.16928 3.05405 -2.16082 0.89323
magnitude: 2.44523 au
magnitude: 6.21527 debye
zeropoint: 0.30999103 hartree
thermalvibcorrection: 0.01821122 hartree
thermalrotcorrection: 0.00141627 hartree
thermaltrasncorrection: 0.00141627 hartree
thermaltotal: -1405.98490719 hartree
thermalcorr: 0.02104376 hartree
nonthermalcorr: 0.30999103 hartree
totalcorr: 0.33103479 hartree
totalenthalpy: -1405.98396298 hartree
