program: Orca
programVersion: 5.0.2
elementType: N H C H C O C C O N H C H H H O H H S H C O C H H C H H C H N H H C O O H H
charge: 1
multiplicity: 1
keywords: wB97X-D3BJ Opt Freq def2-TZVPP def2/J RIJCOSX VeryTightSCF
keywords: PAL8 defgrid3 TightOpt
frequency: 0.00 0.00 0.00 0.00 0.00 0.00 17.89 25.21 26.97 33.04 47.25 60.77 79.49 83.11 105.55 114.88 137.17 147.53 175.11 180.77 229.64 251.26 264.39 275.86 282.28 297.20 331.92 354.22 406.05 417.42 444.09 468.99 503.73 524.17 532.40 545.82 570.39 583.02 600.37 621.65 626.67 640.40 706.37 725.90 732.95 740.07 752.66 778.04 796.08 827.82 863.11 882.83 922.18 931.59 953.04 973.19 998.57 1001.28 1056.92 1082.77 1124.41 1139.68 1145.07 1166.72 1169.24 1204.36 1209.30 1238.73 1249.91 1272.81 1286.41 1288.39 1319.48 1339.24 1352.42 1366.41 1371.00 1377.81 1384.51 1415.03 1423.31 1426.96 1464.32 1474.98 1484.78 1490.48 1496.18 1502.64 1512.78 1556.48 1643.90 1696.93 1714.94 1812.96 1875.67 1891.29 2483.72 2750.46 3089.32 3098.75 3103.03 3105.89 3112.66 3152.96 3160.30 3176.65 3186.11 3208.19 3504.90 3565.97 3589.13 3638.99 3785.85 3807.75
frequency: 17.89 25.21 26.97 33.04 47.25 60.77 79.49 83.11 105.55 114.88 137.17 147.53 175.11 180.77 229.64 251.26 264.39 275.86 282.28 297.20 331.92 354.22 406.05 417.42 444.09 468.99 503.73 524.17 532.40 545.82 570.39 583.02 600.37 621.65 626.67 640.40 706.37 725.90 732.95 740.07 752.66 778.04 796.08 827.82 863.11 882.83 922.18 931.59 953.04 973.19 998.57 1001.28 1056.92 1082.77 1124.41 1139.68 1145.07 1166.72 1169.24 1204.36 1209.30 1238.73 1249.91 1272.81 1286.41 1288.39 1319.48 1339.24 1352.42 1366.41 1371.00 1377.81 1384.51 1415.03 1423.31 1426.96 1464.32 1474.98 1484.78 1490.48 1496.18 1502.64 1512.78 1556.48 1643.90 1696.93 1714.94 1812.96 1875.67 1891.29 2483.72 2750.46 3089.32 3098.75 3103.03 3105.89 3112.66 3152.96 3160.30 3176.65 3186.11 3208.19 3504.90 3565.97 3589.13 3638.99 3785.85 3807.75
formula: C10H18N3O6S
InChI: InChI=1S/C10H18N3O6S/c11-5(10(18)19)1-2-7(14)13-6(4-20)9(17)12-3-8(15)16/h5-6,12-13,15,18,20H,1-4H2,11H3
38 atoms
N  -2.45103 -1.915742 -1.503408
H  -3.317726 -1.76649 -1.997552
C  -1.884384 -3.250339 -1.451889
H  -1.924623 -3.694878 -0.456741
C  -0.425821 -3.2931 -1.909817
O  0.388016 -4.012242 -1.403044
C  -2.034083 -0.8496 -0.758541
C  -0.841592 -1.046613 0.19121
O  -2.570861 0.234747 -0.810207
N  0.042012 0.085105 0.00061
H  -0.290684 -1.961015 0.003663
C  -1.386133 -1.083851 1.627928
H  -0.407661 0.992619 0.022499
H  -1.900319 -0.144918 1.836341
H  -2.118644 -1.883563 1.738632
O  -0.087677 -2.439712 -2.888117
H  -0.850848 -1.910476 -3.15201
H  -2.463713 -3.893682 -2.116171
S  -0.097588 -1.262197 2.880392
H  0.037765 -2.59111 2.796794
C  1.374749 0.107053 -0.041935
O  1.970477 1.200539 0.002836
C  2.193522 -1.158714 -0.216037
H  1.603927 -2.016543 -0.527522
H  2.852002 -0.932328 -1.058277
C  3.0313 -1.56964 1.010922
H  3.855706 -2.200562 0.669077
H  2.43604 -2.177376 1.687744
C  3.577442 -0.420934 1.856763
H  2.74592 0.094085 2.344595
N  4.248849 0.61023 1.006417
H  4.972798 0.204007 0.417265
H  3.439986 1.019229 0.413462
C  4.481488 -0.94449 2.964066
O  4.189877 -1.876285 3.649979
O  5.610976 -0.221745 3.077559
H  6.131174 -0.57615 3.813162
H  4.685669 1.332529 1.575808
totalener: -1406.22662612 hartree
nucrepener: 1864.84001829 hartree
electener: -3271.06664442 hartree
oneelecener: -5612.91335501 hartree
twoeener: 2341.84671059 hartree
kineticenergy: 1400.63407926 hartree
exchangeener: -105.315840878959 hartree
correlationener: -7.053540975207 hartree
xcener: -112.369381854166 hartree
temp: 298.15 k
press: 1.00 atm
thermalcorrenthalpy: 0.00094421 hartree
totalenthalpy: -1405.97985098 hartree
totalentropycorr: -0.06615424 hartree
gibbsenthalpy: -1406.04600522 hartree
gibbsminuselec: 0.26202386 hartree
chargesum: 1.0000000
charge: -0.242276 0.214291 -0.119185 0.134310 0.279127 -0.280056 0.217668 -0.011751 -0.311992 -0.117021 0.075028 -0.162429 0.206821 0.149061 0.129391 -0.224975 0.225137 0.150354 -0.137063 0.113282 0.245155 -0.397237 -0.141461 0.107878 0.151718 -0.271891 0.141111 0.127918 -0.004990 0.151001 -0.056347 0.215297 0.227323 0.275332 -0.250504 -0.290226 0.255599 0.226603
charge: 0.316206 -0.009841 -0.052880 0.033018 -0.464708 0.133987 -0.383221 -0.137413 0.117564 0.370783 0.021951 -0.233697 0.011308 0.022136 0.014165 0.384675 -0.101611 0.044714 0.514575 -0.145051 -0.341558 0.129525 0.002524 0.030107 0.041003 -0.001566 0.037646 0.032705 -0.063129 0.045626 0.593592 0.039391 -0.063193 -0.433323 0.167632 0.355848 -0.067618 0.038127
qa: -0.2423 0.2143 -0.1192 0.1343 0.2791 -0.2801 0.2177 -0.0118 -0.3120 -0.1170 0.0750 -0.1624 0.2068 0.1491 0.1294 -0.2250 0.2251 0.1504 -0.1371 0.1133 0.2452 -0.3972 -0.1415 0.1079 0.1517 -0.2719 0.1411 0.1279 -0.0050 0.1510 -0.0563 0.2153 0.2273 0.2753 -0.2505 -0.2902 0.2556 0.2266
va: 3.0723 0.9957 3.8319 1.0089 4.2672 2.2243 4.3106 3.9334 2.2212 3.2025 1.0607 3.9208 1.0199 1.0134 1.0076 2.2322 1.0272 0.9911 2.1982 1.0212 4.2146 2.1209 3.7642 1.0620 1.0101 3.9492 1.0053 1.0370 3.7387 1.0306 3.5574 0.9905 1.0983 4.3908 2.2509 2.1990 1.0082 0.9873
dispcorr: -0.081963327 hartree
energy: -1406.313444514162
dipole: 2.40259 -0.51233 1.89026 -1.23222 1.84264 0.61042 -1.28538 1.16583 -0.11954
magnitude: 1.98997 au
magnitude: 5.05810 debye
zeropoint: 0.31015477 hartree
thermalvibcorrection: 0.01858020 hartree
thermalrotcorrection: 0.00141627 hartree
thermaltrasncorrection: 0.00141627 hartree
thermaltotal: -1405.98187700 hartree
thermalcorr: 0.02141274 hartree
nonthermalcorr: 0.31015477 hartree
totalcorr: 0.33156752 hartree
totalenthalpy: -1405.98093279 hartree
