program: Orca
programVersion: 5.0.2
elementType: N H C H C O C C O N H C H H H O H H S H C O C H H C H H C H N H H C O O H H
charge: 1
multiplicity: 1
keywords: wB97X-D3BJ Opt Freq def2-TZVPP def2/J RIJCOSX VeryTightSCF
keywords: PAL8 defgrid3 TightOpt
frequency: 0.00 0.00 0.00 0.00 0.00 0.00 34.27 35.50 46.69 57.40 69.68 76.72 91.26 105.55 116.79 130.41 136.19 173.23 195.26 233.34 245.57 256.17 266.73 285.05 302.08 315.37 317.49 341.37 378.03 411.20 428.77 449.32 475.93 507.40 509.43 521.17 544.85 584.35 599.24 604.90 655.62 661.82 696.04 698.78 723.64 732.28 753.60 777.13 800.89 839.20 859.13 888.47 892.17 921.07 963.93 1006.89 1013.91 1023.12 1036.98 1084.61 1104.67 1131.74 1170.40 1173.23 1174.38 1212.89 1214.00 1247.59 1250.82 1268.15 1284.96 1297.68 1312.81 1325.88 1328.37 1347.34 1363.33 1375.26 1402.58 1431.14 1436.71 1453.29 1461.18 1489.43 1493.63 1497.51 1502.10 1507.03 1526.06 1554.13 1665.74 1678.43 1740.85 1816.58 1832.31 1845.02 2753.25 3079.48 3097.31 3102.86 3112.99 3119.73 3131.34 3135.30 3160.94 3177.32 3185.32 3197.48 3350.33 3416.08 3620.11 3640.19 3785.21 3828.28
frequency: 34.27 35.50 46.69 57.40 69.68 76.72 91.26 105.55 116.79 130.41 136.19 173.23 195.26 233.34 245.57 256.17 266.73 285.05 302.08 315.37 317.49 341.37 378.03 411.20 428.77 449.32 475.93 507.40 509.43 521.17 544.85 584.35 599.24 604.90 655.62 661.82 696.04 698.78 723.64 732.28 753.60 777.13 800.89 839.20 859.13 888.47 892.17 921.07 963.93 1006.89 1013.91 1023.12 1036.98 1084.61 1104.67 1131.74 1170.40 1173.23 1174.38 1212.89 1214.00 1247.59 1250.82 1268.15 1284.96 1297.68 1312.81 1325.88 1328.37 1347.34 1363.33 1375.26 1402.58 1431.14 1436.71 1453.29 1461.18 1489.43 1493.63 1497.51 1502.10 1507.03 1526.06 1554.13 1665.74 1678.43 1740.85 1816.58 1832.31 1845.02 2753.25 3079.48 3097.31 3102.86 3112.99 3119.73 3131.34 3135.30 3160.94 3177.32 3185.32 3197.48 3350.33 3416.08 3620.11 3640.19 3785.21 3828.28
formula: C10H18N3O6S
InChI: InChI=1S/C10H18N3O6S/c11-5(10(18)19)1-2-7(14)13-6(4-20)9(17)12-3-8(15)16/h5-6,12-13,15,18,20H,1-4H2,11H3
38 atoms
N  -1.281781 -2.466234 2.519933
H  -0.970999 -2.594012 3.47216
C  -2.003343 -3.573689 1.953763
H  -2.711219 -3.955499 2.69292
C  -1.04843 -4.698183 1.548668
O  0.151614 -4.611742 1.664346
C  -0.487341 -1.591411 1.849163
C  -0.847439 -1.152677 0.405081
O  0.462556 -1.079745 2.431714
N  -0.012997 -0.041138 0.009542
H  -1.86528 -0.764743 0.474271
C  -0.846374 -2.26372 -0.686057
H  -0.393401 0.884778 0.132452
H  -0.229666 -1.910534 -1.508265
H  -0.400909 -3.19579 -0.344651
O  -1.595232 -5.788585 1.02905
H  -2.55631 -5.728249 0.970354
H  -2.588532 -3.265359 1.083875
S  -2.465181 -2.723881 -1.347456
H  -2.789885 -1.525715 -1.847407
C  1.363557 -0.036273 -0.003128
O  1.986077 0.9997 -0.047606
C  2.098585 -1.370018 -0.009163
H  1.444768 -2.202108 0.241935
H  2.442338 -1.544537 -1.031511
C  3.299172 -1.312773 0.947877
H  3.124278 -0.565101 1.724725
H  4.197601 -1.003108 0.41878
C  3.56318 -2.663669 1.607967
H  3.653821 -3.454538 0.860464
N  2.446708 -3.031745 2.543806
H  1.822415 -2.221722 2.714119
H  1.840287 -3.781649 2.194277
C  4.828656 -2.679572 2.461526
O  4.810796 -2.97398 3.629713
O  5.903124 -2.35374 1.762411
H  6.680639 -2.384881 2.338853
H  2.886363 -3.312968 3.431066
totalener: -1406.21911782 hartree
nucrepener: 1890.86003615 hartree
electener: -3297.07915397 hartree
oneelecener: -5664.42853701 hartree
twoeener: 2367.34938303 hartree
kineticenergy: 1400.64187849 hartree
exchangeener: -105.319179190076 hartree
correlationener: -7.057095969227 hartree
xcener: -112.376275159303 hartree
temp: 298.15 k
press: 1.00 atm
thermalcorrenthalpy: 0.00094421 hartree
totalenthalpy: -1405.97304153 hartree
totalentropycorr: -0.06518587 hartree
gibbsenthalpy: -1406.03822741 hartree
gibbsminuselec: 0.26427351 hartree
chargesum: 1.0000000
charge: -0.164529 0.184650 -0.174623 0.173971 0.343852 -0.370669 0.155105 0.108189 -0.377079 -0.208628 0.138384 -0.223603 0.183968 0.162737 0.122018 -0.190320 0.235490 0.130852 -0.137210 0.120659 0.223623 -0.308419 -0.154995 0.021534 0.142368 -0.220931 0.134802 0.143292 0.031255 0.149985 -0.085804 0.230022 0.246004 0.298955 -0.304114 -0.238126 0.256340 0.220994
charge: 0.331334 -0.006175 -0.063805 0.041384 -0.433595 0.104936 -0.352937 -0.139212 0.115599 0.322301 0.040104 -0.249173 -0.010746 0.013538 -0.000272 0.421500 -0.077840 0.010068 0.507154 -0.137580 -0.379131 0.116731 -0.009410 0.011605 0.039760 0.002899 0.040989 0.042948 -0.046541 0.046567 0.609876 -0.003946 0.008584 -0.427846 0.138377 0.408837 -0.061740 0.024856
qa: -0.1645 0.1846 -0.1746 0.1740 0.3439 -0.3707 0.1551 0.1082 -0.3771 -0.2086 0.1384 -0.2236 0.1840 0.1627 0.1220 -0.1903 0.2355 0.1309 -0.1372 0.1207 0.2236 -0.3084 -0.1550 0.0215 0.1424 -0.2209 0.1348 0.1433 0.0313 0.1500 -0.0858 0.2300 0.2460 0.2990 -0.3041 -0.2381 0.2563 0.2210
va: 3.1813 1.0189 3.7872 0.9879 4.2097 2.0739 4.2939 3.6601 2.0974 3.1131 1.0028 3.9289 1.0219 1.0105 1.0109 2.3062 1.0108 1.0713 2.2030 1.0197 4.3353 2.2263 3.8332 1.0107 1.0133 3.8779 1.0244 1.0261 3.8212 1.0049 3.5825 1.0542 1.0112 4.3378 2.1884 2.2798 1.0038 1.0209
dispcorr: -0.084073155 hartree
energy: -1406.308382750904
dipole: -1.16629 0.38017 -0.78612 -0.63278 -1.17472 -1.80750 -1.27971 2.25237 0.97266
magnitude: 2.19798 au
magnitude: 5.58682 debye
zeropoint: 0.31139523 hartree
thermalvibcorrection: 0.01815852 hartree
thermalrotcorrection: 0.00141627 hartree
thermaltrasncorrection: 0.00141627 hartree
thermaltotal: -1405.97599646 hartree
thermalcorr: 0.02099106 hartree
nonthermalcorr: 0.31139523 hartree
totalcorr: 0.33238629 hartree
totalenthalpy: -1405.97505225 hartree
