program: Orca
programVersion: 5.0.2
elementType: N H C H C O C C O N H C H H H O H H S H C O C H H C H H C H N H H C O O H H
charge: 1
multiplicity: 1
keywords: wB97X-D3BJ Opt Freq def2-TZVPP def2/J RIJCOSX VeryTightSCF
keywords: PAL8 defgrid3 TightOpt
frequency: 0.00 0.00 0.00 0.00 0.00 0.00 26.74 43.91 49.23 67.68 76.03 81.89 89.23 100.41 107.63 119.03 125.41 151.56 161.24 220.62 226.82 229.68 266.99 289.07 297.82 312.89 325.84 345.23 415.70 460.37 463.72 474.15 516.86 521.81 544.77 556.91 564.62 593.35 607.65 625.78 628.02 694.62 705.98 733.38 741.78 755.57 765.97 804.11 807.51 836.01 861.83 893.23 896.22 935.36 950.89 975.11 995.73 1002.84 1058.34 1086.55 1100.75 1143.48 1150.70 1165.91 1178.72 1204.33 1227.76 1239.49 1249.55 1272.77 1283.39 1295.39 1304.69 1327.00 1346.71 1365.99 1374.00 1378.76 1408.96 1426.09 1428.76 1436.28 1455.96 1470.78 1484.22 1492.05 1496.58 1503.62 1509.35 1555.56 1619.74 1694.78 1722.52 1804.80 1830.07 1871.56 2235.80 2758.45 3090.24 3099.47 3107.04 3109.87 3112.56 3162.11 3165.23 3166.96 3190.71 3204.70 3509.07 3568.18 3580.43 3640.91 3727.54 3790.16
frequency: 26.74 43.91 49.23 67.68 76.03 81.89 89.23 100.41 107.63 119.03 125.41 151.56 161.24 220.62 226.82 229.68 266.99 289.07 297.82 312.89 325.84 345.23 415.70 460.37 463.72 474.15 516.86 521.81 544.77 556.91 564.62 593.35 607.65 625.78 628.02 694.62 705.98 733.38 741.78 755.57 765.97 804.11 807.51 836.01 861.83 893.23 896.22 935.36 950.89 975.11 995.73 1002.84 1058.34 1086.55 1100.75 1143.48 1150.70 1165.91 1178.72 1204.33 1227.76 1239.49 1249.55 1272.77 1283.39 1295.39 1304.69 1327.00 1346.71 1365.99 1374.00 1378.76 1408.96 1426.09 1428.76 1436.28 1455.96 1470.78 1484.22 1492.05 1496.58 1503.62 1509.35 1555.56 1619.74 1694.78 1722.52 1804.80 1830.07 1871.56 2235.80 2758.45 3090.24 3099.47 3107.04 3109.87 3112.56 3162.11 3165.23 3166.96 3190.71 3204.70 3509.07 3568.18 3580.43 3640.91 3727.54 3790.16
formula: C10H18N3O6S
InChI: InChI=1S/C10H18N3O6S/c11-5(10(18)19)1-2-7(14)13-6(4-20)9(17)12-3-8(15)16/h5-6,12-13,15,18,20H,1-4H2,11H3
38 atoms
N  -2.574717 -1.487604 -1.760603
H  -3.316042 -1.100047 -2.324171
C  -1.830527 -2.61028 -2.299527
H  -1.699661 -3.407497 -1.568374
C  -0.450349 -2.2133 -2.808595
O  0.553797 -2.833047 -2.554428
C  -2.090523 -0.621179 -0.835762
C  -0.908373 -1.074919 0.040338
O  -2.571282 0.474696 -0.630958
N  0.027032 0.038468 0.039384
H  -0.41128 -1.958296 -0.345439
C  -1.456399 -1.368863 1.444245
H  -0.41108 0.953345 0.05555
H  -2.030655 -0.516488 1.803437
H  -2.13656 -2.22022 1.387015
O  -0.478409 -1.088666 -3.518222
H  0.431347 -0.816222 -3.719626
H  -2.398422 -3.024097 -3.133476
S  -0.179986 -1.809447 2.643861
H  0.138847 -0.563274 3.009903
C  1.352562 0.032319 0.025231
O  1.967205 1.12588 0.042052
C  2.157845 -1.24944 0.01527
H  2.72663 -1.225516 0.948872
H  1.531864 -2.133099 0.08038
C  3.104633 -1.430759 -1.191286
H  2.542696 -1.835521 -2.03148
H  3.838791 -2.190383 -0.916014
C  3.848741 -0.201604 -1.70696
H  4.69969 -0.522715 -2.313342
N  4.357107 0.648309 -0.586064
H  3.419486 0.974768 -0.099819
H  4.95087 0.117628 0.045866
C  2.99283 0.673912 -2.624413
O  2.046561 0.276223 -3.243564
O  3.480375 1.914362 -2.701272
H  2.932431 2.438814 -3.302569
H  4.870125 1.457315 -0.930013
totalener: -1406.23645739 hartree
nucrepener: 1936.69670528 hartree
electener: -3342.93316267 hartree
oneelecener: -5757.01776414 hartree
twoeener: 2414.08460147 hartree
kineticenergy: 1400.64002927 hartree
exchangeener: -105.325623203394 hartree
correlationener: -7.058318303795 hartree
xcener: -112.383941507189 hartree
temp: 298.15 k
press: 1.00 atm
thermalcorrenthalpy: 0.00094421 hartree
totalenthalpy: -1405.99246998 hartree
totalentropycorr: -0.06538711 hartree
gibbsenthalpy: -1406.05785708 hartree
gibbsminuselec: 0.26200100 hartree
chargesum: 1.0000000
charge: -0.189675 0.198266 -0.087671 0.130051 0.317937 -0.343718 0.235056 0.004156 -0.335173 -0.099197 0.083271 -0.169648 0.206583 0.146955 0.132717 -0.262624 0.252011 0.137985 -0.137507 0.109647 0.234492 -0.410240 -0.192102 0.138765 0.123508 -0.205481 0.134810 0.137307 -0.030390 0.157630 -0.084272 0.228508 0.214468 0.332125 -0.319967 -0.271550 0.256704 0.226264
charge: 0.328897 -0.005103 -0.044467 0.033191 -0.454693 0.107627 -0.383783 -0.132649 0.105513 0.379248 0.022703 -0.234830 0.012149 0.018103 0.018787 0.386330 -0.105931 0.044004 0.505430 -0.149340 -0.332039 0.147747 -0.010503 0.036919 0.029883 0.007584 0.032875 0.035527 -0.058177 0.048711 0.583325 -0.084130 0.032209 -0.420991 0.149456 0.383482 -0.063728 0.030662
qa: -0.1897 0.1983 -0.0877 0.1301 0.3179 -0.3437 0.2351 0.0042 -0.3352 -0.0992 0.0833 -0.1696 0.2066 0.1470 0.1327 -0.2626 0.2520 0.1380 -0.1375 0.1096 0.2345 -0.4102 -0.1921 0.1388 0.1235 -0.2055 0.1348 0.1373 -0.0304 0.1576 -0.0843 0.2285 0.2145 0.3321 -0.3200 -0.2716 0.2567 0.2263
va: 3.1598 1.0105 3.8635 1.0052 4.2272 2.1636 4.2961 3.9007 2.1918 3.2062 1.0323 3.9373 1.0240 1.0164 1.0081 2.2500 1.0314 0.9960 2.1856 1.0234 4.2075 2.1062 3.8457 1.0127 1.0326 3.7904 1.0666 1.0028 3.8872 1.0000 3.5053 1.1040 0.9844 4.3004 2.1480 2.2369 1.0079 0.9901
dispcorr: -0.083626980 hartree
energy: -1406.325426382665
dipole: 7.54272 -3.90808 3.63464 -3.12504 3.63949 0.51445 2.71769 -3.10737 -0.38969
magnitude: 3.69149 au
magnitude: 9.38302 debye
zeropoint: 0.31035529 hartree
thermalvibcorrection: 0.01805142 hartree
thermalrotcorrection: 0.00141627 hartree
thermaltrasncorrection: 0.00141627 hartree
thermaltotal: -1405.99418713 hartree
thermalcorr: 0.02088396 hartree
nonthermalcorr: 0.31035529 hartree
totalcorr: 0.33123925 hartree
totalenthalpy: -1405.99324292 hartree
