program: Orca
programVersion: 5.0.2
elementType: N H C H C O C C O N H C H H H O H H S H C O C H H C H H C H N H H C O O H H
charge: 1
multiplicity: 1
keywords: wB97X-D3BJ Opt Freq def2-TZVPP def2/J RIJCOSX VeryTightSCF
keywords: PAL8 defgrid3 TightOpt
frequency: 0.00 0.00 0.00 0.00 0.00 0.00 20.40 37.84 47.82 62.96 64.83 80.88 89.81 92.70 96.70 114.19 135.75 153.36 172.70 190.32 220.74 241.43 260.01 271.15 289.07 296.12 313.57 314.58 371.22 373.36 442.38 455.83 483.48 512.26 523.69 546.88 577.63 598.78 611.05 623.79 660.71 669.04 696.90 731.61 740.70 763.68 776.95 791.77 812.09 826.18 845.80 891.55 903.71 938.62 948.00 966.22 1009.61 1019.27 1058.80 1103.64 1119.13 1138.57 1151.57 1170.52 1186.83 1208.73 1214.91 1221.71 1229.74 1286.20 1288.34 1304.19 1318.98 1339.01 1361.84 1367.29 1371.43 1381.59 1401.29 1422.33 1442.78 1452.33 1468.57 1491.71 1496.82 1505.93 1510.19 1532.05 1537.07 1552.41 1665.43 1679.78 1711.47 1797.22 1846.36 1854.31 2767.35 2912.34 3099.72 3107.89 3110.97 3122.92 3124.09 3141.78 3150.90 3164.63 3167.43 3185.00 3358.18 3550.45 3603.71 3644.37 3767.75 3781.97
frequency: 20.40 37.84 47.82 62.96 64.83 80.88 89.81 92.70 96.70 114.19 135.75 153.36 172.70 190.32 220.74 241.43 260.01 271.15 289.07 296.12 313.57 314.58 371.22 373.36 442.38 455.83 483.48 512.26 523.69 546.88 577.63 598.78 611.05 623.79 660.71 669.04 696.90 731.61 740.70 763.68 776.95 791.77 812.09 826.18 845.80 891.55 903.71 938.62 948.00 966.22 1009.61 1019.27 1058.80 1103.64 1119.13 1138.57 1151.57 1170.52 1186.83 1208.73 1214.91 1221.71 1229.74 1286.20 1288.34 1304.19 1318.98 1339.01 1361.84 1367.29 1371.43 1381.59 1401.29 1422.33 1442.78 1452.33 1468.57 1491.71 1496.82 1505.93 1510.19 1532.05 1537.07 1552.41 1665.43 1679.78 1711.47 1797.22 1846.36 1854.31 2767.35 2912.34 3099.72 3107.89 3110.97 3122.92 3124.09 3141.78 3150.90 3164.63 3167.43 3185.00 3358.18 3550.45 3603.71 3644.37 3767.75 3781.97
formula: C10H18N3O6S
InChI: InChI=1S/C10H18N3O6S/c11-5(10(18)19)1-2-7(14)13-6(4-20)9(17)12-3-8(15)16/h5-6,12-13,15,18,20H,1-4H2,11H3
38 atoms
N  -0.74514 -0.628133 -3.007113
H  -0.42707 -0.998826 -3.889004
C  -1.372561 0.680887 -3.019792
H  -1.450005 0.992827 -4.061856
C  -0.57443 1.742641 -2.276439
O  -1.067668 2.510008 -1.494143
C  -0.527359 -1.450387 -1.975786
C  -0.874218 -1.063149 -0.519257
O  0.022181 -2.542878 -2.180981
N  0.000855 -0.013182 -0.026283
H  -0.700924 -1.987594 0.031242
C  -2.324902 -0.646925 -0.264033
H  -0.384669 0.919458 0.028463
H  -2.502171 -0.72453 0.807614
H  -2.490113 0.388746 -0.55768
O  0.725586 1.702143 -2.582013
H  1.195961 2.322601 -2.004565
H  -2.381296 0.644929 -2.616113
S  -3.433891 -1.758724 -1.168242
H  -4.572307 -1.279055 -0.657643
C  1.366572 -0.042704 0.057874
O  2.014264 0.979767 0.148922
C  2.055892 -1.396633 0.044619
H  2.696431 -1.418479 0.928338
H  1.338577 -2.211004 0.138359
C  2.907516 -1.532758 -1.222986
H  3.772948 -0.874719 -1.153652
H  2.345545 -1.224506 -2.106676
C  3.404852 -2.960809 -1.450067
H  4.054942 -2.994815 -2.32406
N  2.258391 -3.907247 -1.666583
H  2.209051 -4.512513 -0.835314
H  1.346588 -3.398618 -1.801821
C  4.163624 -3.501151 -0.241541
O  3.743458 -4.4129 0.424022
O  5.28579 -2.834513 -0.028698
H  5.732008 -3.193542 0.75249
H  2.409273 -4.505637 -2.475255
totalener: -1406.22528341 hartree
nucrepener: 1904.81827721 hartree
electener: -3311.04356063 hartree
oneelecener: -5692.75731108 hartree
twoeener: 2381.71375045 hartree
kineticenergy: 1400.64552258 hartree
exchangeener: -105.322445246204 hartree
correlationener: -7.056826551450 hartree
xcener: -112.379271797654 hartree
temp: 298.15 k
press: 1.00 atm
thermalcorrenthalpy: 0.00094421 hartree
totalenthalpy: -1405.97978805 hartree
totalentropycorr: -0.06545725 hartree
gibbsenthalpy: -1406.04524529 hartree
gibbsminuselec: 0.26418902 hartree
chargesum: 1.0000000
charge: -0.101491 0.189484 -0.092926 0.145747 0.256370 -0.283555 0.202513 0.039057 -0.440061 -0.202251 0.146899 -0.209243 0.193800 0.154163 0.111513 -0.263953 0.256974 0.142164 -0.133566 0.128668 0.190164 -0.336448 -0.166026 0.149778 0.083533 -0.214563 0.159524 0.119728 -0.013066 0.161152 -0.062275 0.221407 0.222077 0.287970 -0.296762 -0.234017 0.259388 0.228129
charge: 0.357769 -0.001969 -0.030477 0.045427 -0.462797 0.130705 -0.357416 -0.150067 0.096798 0.332480 0.037162 -0.226983 -0.014494 0.014166 -0.000305 0.375564 -0.073483 0.031373 0.499118 -0.137491 -0.381732 0.100888 -0.005361 0.043044 0.014448 0.000289 0.047739 0.031380 -0.044994 0.045366 0.609802 0.028104 -0.052319 -0.438312 0.140847 0.411801 -0.060509 0.044440
qa: -0.1015 0.1895 -0.0929 0.1457 0.2564 -0.2836 0.2025 0.0391 -0.4401 -0.2023 0.1469 -0.2092 0.1938 0.1542 0.1115 -0.2640 0.2570 0.1422 -0.1336 0.1287 0.1902 -0.3364 -0.1660 0.1498 0.0835 -0.2146 0.1595 0.1197 -0.0131 0.1612 -0.0623 0.2214 0.2221 0.2880 -0.2968 -0.2340 0.2594 0.2281
va: 3.1757 1.0157 3.8215 0.9952 4.3391 2.2028 4.1806 3.7666 2.0438 3.0864 1.0064 4.0849 1.0327 0.9958 1.0111 2.2173 1.0069 1.0177 2.1808 1.0170 4.3352 2.1862 3.7727 1.0259 1.0260 3.8497 1.0222 1.0211 3.8866 1.0001 3.5739 1.0190 1.0935 4.3352 2.1919 2.2875 1.0007 0.9789
dispcorr: -0.084268886 hartree
energy: -1406.315209859998
dipole: 1.04484 0.54883 1.59367 -3.90005 1.32230 -2.57775 -1.42476 0.13662 -1.28813
magnitude: 3.29300 au
magnitude: 8.37014 debye
zeropoint: 0.31127100 hartree
thermalvibcorrection: 0.01846089 hartree
thermalrotcorrection: 0.00141627 hartree
thermaltrasncorrection: 0.00141627 hartree
thermaltotal: -1405.98264543 hartree
thermalcorr: 0.02129343 hartree
nonthermalcorr: 0.31127100 hartree
totalcorr: 0.33256443 hartree
totalenthalpy: -1405.98170122 hartree
