program: Orca
programVersion: 5.0.2
elementType: N H C C H H O C C O N H H H C C O H O H N H H H C H H C C C C H C H C H H O H
charge: 1
multiplicity: 1
keywords: wB97X-D3BJ Opt Freq def2-TZVPP def2/J RIJCOSX VeryTightSCF
keywords: PAL8 defgrid3 VeryTightOpt
frequency: 0.00 0.00 0.00 0.00 0.00 0.00 13.24 27.55 36.89 46.84 48.58 61.10 70.41 76.25 121.49 147.63 158.62 184.99 245.06 263.00 294.18 307.56 310.36 334.87 349.11 362.07 381.90 387.78 410.61 428.97 436.58 483.16 508.95 517.19 530.21 537.99 558.21 595.20 616.61 655.39 659.27 677.92 711.87 727.23 750.40 785.02 810.83 847.50 857.79 875.05 879.52 885.19 902.43 908.12 965.97 983.18 1010.19 1041.86 1048.51 1059.75 1060.03 1106.29 1114.53 1143.18 1153.29 1167.10 1189.93 1199.22 1207.86 1248.26 1269.14 1278.71 1281.44 1306.52 1311.25 1328.43 1333.30 1334.24 1348.54 1372.27 1392.91 1399.64 1415.47 1444.16 1466.23 1474.71 1495.75 1502.93 1507.81 1572.36 1580.92 1602.12 1621.85 1673.33 1680.38 1701.42 1739.10 1806.37 1862.63 3072.13 3117.54 3122.46 3125.03 3145.07 3172.22 3173.97 3178.64 3186.59 3201.53 3205.11 3231.36 3445.23 3528.39 3667.48 3669.40 3804.65 3877.27
frequency: 13.24 27.55 36.89 46.84 48.58 61.10 70.41 76.25 121.49 147.63 158.62 184.99 245.06 263.00 294.18 307.56 310.36 334.87 349.11 362.07 381.90 387.78 410.61 428.97 436.58 483.16 508.95 517.19 530.21 537.99 558.21 595.20 616.61 655.39 659.27 677.92 711.87 727.23 750.40 785.02 810.83 847.50 857.79 875.05 879.52 885.19 902.43 908.12 965.97 983.18 1010.19 1041.86 1048.51 1059.75 1060.03 1106.29 1114.53 1143.18 1153.29 1167.10 1189.93 1199.22 1207.86 1248.26 1269.14 1278.71 1281.44 1306.52 1311.25 1328.43 1333.30 1334.24 1348.54 1372.27 1392.91 1399.64 1415.47 1444.16 1466.23 1474.71 1495.75 1502.93 1507.81 1572.36 1580.92 1602.12 1621.85 1673.33 1680.38 1701.42 1739.10 1806.37 1862.63 3072.13 3117.54 3122.46 3125.03 3145.07 3172.22 3173.97 3178.64 3186.59 3201.53 3205.11 3231.36 3445.23 3528.39 3667.48 3669.40 3804.65 3877.27
formula: C13H18N3O5
InChI: InChI=1S/C13H18N3O5/c14-10(5-8-1-3-9(17)4-2-8)13(21)16-6-11(18)15-7-12(19)20/h1-4,10,15-17,19H,5-7H2,14H3
39 atoms
N  -1.200186 1.749783 2.943247
H  -1.910935 2.300299 2.491294
C  -1.276628 1.587705 4.376034
C  -2.118718 0.37328 4.743874
H  -0.278637 1.461487 4.794444
H  -1.714237 2.478565 4.825777
O  -2.662733 -0.344795 3.950973
C  -0.487323 0.898741 2.193806
C  -0.695087 1.018155 0.674236
O  0.291447 0.080207 2.681045
N  0.008855 -0.057359 0.012418
H  -0.311861 1.978871 0.331303
H  -1.757634 0.962257 0.438155
H  -0.435248 -0.957712 0.078764
C  1.361049 -0.041431 0.13516
C  2.079018 -1.379799 0.363072
O  2.024648 0.971085 0.217106
H  2.936136 -1.436726 -0.307392
O  -2.169393 0.220081 6.071662
H  -2.725323 -0.546173 6.267504
N  2.624978 -1.174686 1.755283
H  3.037305 -2.042152 2.106962
H  3.311165 -0.41987 1.742483
H  1.836609 -0.861667 2.354728
C  1.279822 -2.679815 0.333749
H  0.902845 -2.820888 -0.681895
H  0.419582 -2.601717 1.004752
C  2.139624 -3.847517 0.759395
C  3.091655 -4.388439 -0.102419
C  2.03907 -4.371613 2.049169
C  3.922594 -5.418881 0.3071
H  3.181277 -4.012879 -1.117027
C  2.866283 -5.399023 2.474803
H  1.283129 -3.989216 2.729558
C  3.814563 -5.927031 1.601676
H  4.650471 -5.835444 -0.381038
H  2.780323 -5.814338 3.470887
O  4.594195 -6.929942 2.065589
H  5.189607 -7.242867 1.379692
totalener: -1047.14245746 hartree
nucrepener: 1686.29994421 hartree
electener: -2733.44240167 hartree
oneelecener: -4757.03255065 hartree
twoeener: 2023.59014898 hartree
kineticenergy: 1041.99947898 hartree
exchangeener: -91.591827392718 hartree
correlationener: -6.612735443286 hartree
xcener: -98.204562836005 hartree
temp: 298.15 k
press: 1.00 atm
thermalcorrenthalpy: 0.00094421 hartree
totalenthalpy: -1046.88200566 hartree
totalentropycorr: -0.06412909 hartree
gibbsenthalpy: -1046.94613476 hartree
gibbsminuselec: 0.27795463 hartree
totalenthalpy: -1046.88373988 hartree
chargesum: 1.0000000
charge: -0.191885 0.186943 -0.064409 0.285694 0.128669 0.146792 -0.309793 0.358997 -0.098091 -0.485981 -0.167544 0.156323 0.146742 0.179189 0.149217 0.040979 -0.324462 0.170250 -0.258684 0.242875 -0.077432 0.231980 0.240354 0.248926 -0.210044 0.146868 0.118957 -0.002997 -0.176587 -0.234943 -0.140420 0.136420 -0.127311 0.148074 0.197265 0.116351 0.144597 -0.269918 0.218039
charge: 0.346740 -0.007313 -0.034549 -0.442880 0.039914 0.039821 0.116105 -0.351171 -0.029257 0.075449 0.329158 0.042496 0.035300 -0.022335 -0.388464 -0.038969 0.116345 0.044810 0.374745 -0.079938 0.617221 0.039696 0.051350 0.009348 -0.011480 0.044094 0.033744 -0.115722 -0.000733 -0.020219 -0.006722 0.028186 0.006065 0.024681 -0.190128 0.023702 0.031351 0.371244 -0.101683
qa: -0.1919 0.1869 -0.0644 0.2857 0.1287 0.1468 -0.3098 0.3590 -0.0981 -0.4860 -0.1675 0.1563 0.1467 0.1792 0.1492 0.0410 -0.3245 0.1702 -0.2587 0.2429 -0.0774 0.2320 0.2404 0.2489 -0.2100 0.1469 0.1190 -0.0030 -0.1766 -0.2349 -0.1404 0.1364 -0.1273 0.1481 0.1973 0.1164 0.1446 -0.2699 0.2180
va: 3.2710 1.0098 3.7870 4.3358 1.0223 1.0047 2.1907 4.0773 3.8698 2.0057 3.2142 1.0052 0.9980 1.0162 4.3849 3.7869 2.1859 1.0075 2.2211 1.0140 3.6279 0.9903 0.9847 1.0287 3.8463 1.0022 1.0176 3.5827 4.0505 3.9701 3.9511 1.0044 3.9969 1.0003 4.0904 1.0069 1.0080 2.2312 1.0252
dispcorr: -0.082343948 hartree
energy: -1047.229687899743
dipole: 2.54000 -2.11184 0.42816 -0.52833 1.10737 0.57904 -3.21484 2.85287 -0.36197
magnitude: 0.80599 au
magnitude: 2.04867 debye
zeropoint: 0.32467030 hartree
thermalvibcorrection: 0.01749620 hartree
thermalrotcorrection: 0.00141627 hartree
thermaltrasncorrection: 0.00141627 hartree
thermaltotal: -1046.88468886 hartree
thermalcorr: 0.02032874 hartree
nonthermalcorr: 0.32467030 hartree
totalcorr: 0.34499904 hartree
totalenthalpy: -1046.88374465 hartree
