program: Orca
programVersion: 5.0.2
elementType: N H C C H H O C C O N H H H C C O H O H N H H H C H H C C C C H C H C H H O H
charge: 1
multiplicity: 1
keywords: wB97X-D3BJ Opt Freq def2-TZVPP def2/J RIJCOSX VeryTightSCF
keywords: PAL8 defgrid3 VeryTightOpt
frequency: 0.00 0.00 0.00 0.00 0.00 0.00 14.42 18.30 27.66 43.94 52.60 59.15 60.49 87.79 98.18 104.43 145.60 173.79 181.63 207.09 253.37 302.77 305.74 313.06 319.37 329.97 369.23 394.87 406.68 426.32 436.28 471.68 510.37 526.12 539.37 556.22 575.71 630.90 633.77 659.39 664.19 672.85 704.72 727.06 746.01 768.34 803.76 847.95 865.00 883.65 887.42 927.26 961.62 976.66 996.20 1006.10 1011.59 1016.57 1028.63 1040.98 1044.76 1100.05 1123.10 1138.14 1161.80 1173.87 1198.51 1206.89 1207.32 1227.39 1250.86 1252.52 1257.07 1261.64 1272.60 1325.61 1331.68 1335.48 1354.33 1360.61 1369.52 1390.48 1402.07 1427.23 1465.65 1497.58 1498.96 1502.75 1506.26 1583.19 1584.90 1599.97 1639.84 1666.84 1676.89 1703.55 1767.61 1781.07 1851.75 2838.01 3053.62 3088.39 3091.80 3105.68 3129.27 3131.24 3149.71 3178.41 3189.66 3206.61 3233.27 3513.64 3522.77 3580.05 3620.85 3802.76 3881.74
frequency: 14.42 18.30 27.66 43.94 52.60 59.15 60.49 87.79 98.18 104.43 145.60 173.79 181.63 207.09 253.37 302.77 305.74 313.06 319.37 329.97 369.23 394.87 406.68 426.32 436.28 471.68 510.37 526.12 539.37 556.22 575.71 630.90 633.77 659.39 664.19 672.85 704.72 727.06 746.01 768.34 803.76 847.95 865.00 883.65 887.42 927.26 961.62 976.66 996.20 1006.10 1011.59 1016.57 1028.63 1040.98 1044.76 1100.05 1123.10 1138.14 1161.80 1173.87 1198.51 1206.89 1207.32 1227.39 1250.86 1252.52 1257.07 1261.64 1272.60 1325.61 1331.68 1335.48 1354.33 1360.61 1369.52 1390.48 1402.07 1427.23 1465.65 1497.58 1498.96 1502.75 1506.26 1583.19 1584.90 1599.97 1639.84 1666.84 1676.89 1703.55 1767.61 1781.07 1851.75 2838.01 3053.62 3088.39 3091.80 3105.68 3129.27 3131.24 3149.71 3178.41 3189.66 3206.61 3233.27 3513.64 3522.77 3580.05 3620.85 3802.76 3881.74
formula: C13H18N3O5
InChI: InChI=1S/C13H18N3O5/c14-10(5-8-1-3-9(17)4-2-8)13(21)16-6-11(18)15-7-12(19)20/h1-4,10,15-17,19H,5-7H2,14H3
39 atoms
N  -3.227074 1.712981 -0.025855
H  -2.962987 2.686217 -0.077423
C  -4.645785 1.43958 -0.025427
C  -5.380177 2.759158 -0.104595
H  -4.933196 0.814186 -0.873779
H  -4.952868 0.910937 0.879903
O  -4.83329 3.829767 -0.158563
C  -2.319362 0.728445 0.005569
C  -0.859021 1.181735 -0.011869
O  -2.600944 -0.45905 0.050792
N  -0.051047 -0.019945 -0.031683
H  -0.638564 1.782228 0.873783
H  -0.656712 1.797797 -0.890531
H  -0.581205 -0.885562 0.019537
C  1.266119 0.007136 -0.000733
C  2.016984 -1.343078 0.003658
O  1.954668 1.03299 0.016064
H  1.723528 -1.94216 -0.857081
O  -6.702842 2.583451 -0.105887
H  -7.122666 3.452825 -0.15978
N  3.447991 -0.913952 -0.1732
H  4.057591 -1.283575 0.552759
H  3.83313 -1.155273 -1.082725
H  3.349551 0.143453 -0.09058
C  1.857182 -2.147389 1.300478
H  2.151035 -1.518402 2.145973
H  2.552012 -2.993015 1.258829
C  0.444807 -2.642259 1.491634
C  -0.347187 -2.161314 2.527728
C  -0.105355 -3.574506 0.609609
C  -1.657787 -2.587564 2.681774
H  0.059688 -1.440897 3.229699
C  -1.412788 -4.001911 0.744973
H  0.496932 -3.986642 -0.195059
C  -2.198178 -3.503119 1.783816
H  -2.262117 -2.20227 3.4959
H  -1.843068 -4.722847 0.061816
O  -3.471299 -3.951971 1.865844
H  -3.921733 -3.549464 2.612379
totalener: -1047.14027240 hartree
nucrepener: 1699.36495704 hartree
electener: -2746.50522944 hartree
oneelecener: -4784.14009477 hartree
twoeener: 2037.63486534 hartree
kineticenergy: 1041.97983838 hartree
exchangeener: -91.590372543456 hartree
correlationener: -6.613470103683 hartree
xcener: -98.203842647139 hartree
temp: 298.15 k
press: 1.00 atm
thermalcorrenthalpy: 0.00094421 hartree
totalenthalpy: -1046.88116354 hartree
totalentropycorr: -0.06476576 hartree
gibbsenthalpy: -1046.94592930 hartree
gibbsminuselec: 0.27480646 hartree
totalenthalpy: -1046.88243898 hartree
chargesum: 1.0000000
charge: -0.197884 0.183623 -0.058263 0.302485 0.133659 0.126328 -0.322715 0.289225 -0.111214 -0.396658 -0.148806 0.136288 0.141441 0.211531 0.225259 -0.009527 -0.376575 0.157535 -0.255456 0.242277 -0.061037 0.226638 0.232242 0.231089 -0.162791 0.125242 0.133650 -0.048110 -0.170717 -0.169363 -0.122833 0.121959 -0.129584 0.114301 0.225948 0.103744 0.136455 -0.273248 0.213862
charge: 0.334307 -0.019343 -0.031012 -0.433083 0.039720 0.037308 0.114809 -0.387034 -0.016123 0.086261 0.367773 0.034314 0.034779 -0.012063 -0.366266 -0.031863 0.113516 0.036835 0.380065 -0.077714 0.605134 0.041400 0.042782 -0.011613 -0.007978 0.039010 0.035126 -0.116243 -0.005142 -0.012181 -0.010401 0.024750 0.012194 0.022766 -0.185030 0.021091 0.030970 0.372084 -0.103904
qa: -0.1979 0.1836 -0.0583 0.3025 0.1337 0.1263 -0.3227 0.2892 -0.1112 -0.3967 -0.1488 0.1363 0.1414 0.2115 0.2253 -0.0095 -0.3766 0.1575 -0.2555 0.2423 -0.0610 0.2266 0.2322 0.2311 -0.1628 0.1252 0.1337 -0.0481 -0.1707 -0.1694 -0.1228 0.1220 -0.1296 0.1143 0.2259 0.1037 0.1365 -0.2732 0.2139
va: 3.1935 1.0386 3.8622 4.3251 1.0078 1.0086 2.1687 4.1907 3.8650 2.1121 3.2865 1.0014 1.0003 1.0245 4.2454 3.8607 2.1577 0.9995 2.2351 1.0146 3.5902 0.9808 0.9769 1.0570 3.8292 1.0071 0.9958 3.6669 4.0438 3.9993 3.9394 1.0078 4.0363 1.0076 4.0650 1.0078 1.0107 2.2301 1.0281
dispcorr: -0.080790866 hartree
energy: -1047.226774493956
dipole: 12.90582 -8.60179 4.30403 -4.86105 4.40392 -0.45712 0.70419 -1.13460 -0.43041
magnitude: 4.34958 au
magnitude: 11.05577 debye
zeropoint: 0.32256720 hartree
thermalvibcorrection: 0.01797677 hartree
thermalrotcorrection: 0.00141627 hartree
thermaltrasncorrection: 0.00141627 hartree
thermaltotal: -1046.88339798 hartree
thermalcorr: 0.02080931 hartree
nonthermalcorr: 0.32256720 hartree
totalcorr: 0.34337651 hartree
totalenthalpy: -1046.88245378 hartree
