program: Orca
programVersion: 5.0.2
elementType: N H C C H H O C C O N H H H C C O H O H N H H H C H H C C C C H C H C H H O H
charge: 1
multiplicity: 1
keywords: wB97X-D3BJ Opt Freq def2-TZVPP def2/J RIJCOSX VeryTightSCF
keywords: PAL8 defgrid3 VeryTightOpt
frequency: 0.00 0.00 0.00 0.00 0.00 0.00 13.31 16.51 29.27 41.79 50.89 59.54 64.37 74.15 86.97 100.72 132.99 182.57 204.76 235.11 273.12 287.89 295.90 314.65 335.05 365.43 383.21 386.78 417.81 429.56 434.10 478.33 505.54 515.81 526.51 554.01 577.16 595.09 651.47 658.37 662.22 673.47 702.31 729.23 750.87 755.99 831.52 856.19 864.43 879.49 883.55 890.30 906.66 955.83 983.28 987.68 1010.25 1019.85 1041.26 1064.31 1069.72 1097.82 1107.64 1129.29 1150.65 1169.14 1190.06 1197.90 1207.32 1246.30 1251.61 1257.61 1264.14 1278.10 1299.42 1316.46 1333.32 1335.23 1342.81 1371.08 1380.86 1394.88 1416.26 1444.91 1447.93 1464.22 1492.61 1500.05 1506.38 1579.68 1584.04 1599.56 1639.87 1668.86 1673.08 1700.06 1773.77 1791.87 1860.66 3085.01 3087.89 3121.30 3127.19 3132.56 3136.25 3151.55 3174.46 3178.07 3185.93 3204.86 3232.05 3397.44 3540.15 3552.58 3666.14 3807.18 3876.59
frequency: 13.31 16.51 29.27 41.79 50.89 59.54 64.37 74.15 86.97 100.72 132.99 182.57 204.76 235.11 273.12 287.89 295.90 314.65 335.05 365.43 383.21 386.78 417.81 429.56 434.10 478.33 505.54 515.81 526.51 554.01 577.16 595.09 651.47 658.37 662.22 673.47 702.31 729.23 750.87 755.99 831.52 856.19 864.43 879.49 883.55 890.30 906.66 955.83 983.28 987.68 1010.25 1019.85 1041.26 1064.31 1069.72 1097.82 1107.64 1129.29 1150.65 1169.14 1190.06 1197.90 1207.32 1246.30 1251.61 1257.61 1264.14 1278.10 1299.42 1316.46 1333.32 1335.23 1342.81 1371.08 1380.86 1394.88 1416.26 1444.91 1447.93 1464.22 1492.61 1500.05 1506.38 1579.68 1584.04 1599.56 1639.87 1668.86 1673.08 1700.06 1773.77 1791.87 1860.66 3085.01 3087.89 3121.30 3127.19 3132.56 3136.25 3151.55 3174.46 3178.07 3185.93 3204.86 3232.05 3397.44 3540.15 3552.58 3666.14 3807.18 3876.59
formula: C13H18N3O5
InChI: InChI=1S/C13H18N3O5/c14-10(5-8-1-3-9(17)4-2-8)13(21)16-6-11(18)15-7-12(19)20/h1-4,10,15-17,19H,5-7H2,14H3
39 atoms
N  -3.232653 1.631992 0.022597
H  -2.946455 2.580373 -0.154819
C  -4.600652 1.282051 -0.279009
C  -4.792025 1.050976 -1.770871
H  -4.87361 0.372438 0.254378
H  -5.271275 2.075908 0.050083
O  -3.931938 1.189079 -2.597265
C  -2.281772 0.674844 -0.000161
C  -0.838795 1.176208 0.016779
O  -2.518986 -0.520638 -0.013327
N  -0.000312 -0.003598 0.01085
H  -0.64804 1.79227 -0.865199
H  -0.650446 1.784344 0.904066
H  -0.52645 -0.870955 -0.026275
C  1.321765 0.040232 0.044529
C  2.051768 -1.312146 0.100526
O  2.002717 1.062789 0.079213
H  1.697829 -2.00532 -0.661251
O  -6.050441 0.682787 -2.038747
H  -6.128829 0.554195 -2.993452
N  3.476112 -0.959756 -0.200207
H  4.112848 -1.50044 0.394712
H  3.722891 -1.116749 -1.174543
H  3.51512 0.067345 -0.011286
C  1.961272 -1.942688 1.502088
H  0.93873 -2.298679 1.637192
H  2.130593 -1.163158 2.24949
C  2.963394 -3.056821 1.671203
C  2.763012 -4.301454 1.075775
C  4.14952 -2.842901 2.376553
C  3.714874 -5.302477 1.176269
H  1.842064 -4.50398 0.537757
C  5.114026 -3.833739 2.481324
H  4.3129 -1.895368 2.882914
C  4.898918 -5.070453 1.878344
H  3.536492 -6.269523 0.718079
H  6.027229 -3.672709 3.040029
O  5.867793 -6.002988 2.012988
H  5.608113 -6.828185 1.595104
totalener: -1047.14514775 hartree
nucrepener: 1589.47814100 hartree
electener: -2636.62328875 hartree
oneelecener: -4564.07587035 hartree
twoeener: 1927.45258160 hartree
kineticenergy: 1041.97953627 hartree
exchangeener: -91.589058357657 hartree
correlationener: -6.610659365113 hartree
xcener: -98.199717722770 hartree
temp: 298.15 k
press: 1.00 atm
thermalcorrenthalpy: 0.00094421 hartree
totalenthalpy: -1046.88226347 hartree
totalentropycorr: -0.06496333 hartree
gibbsenthalpy: -1046.94722680 hartree
gibbsminuselec: 0.27588244 hartree
totalenthalpy: -1046.88414396 hartree
chargesum: 1.0000000
charge: -0.203894 0.178333 -0.067419 0.291829 0.137057 0.140600 -0.316318 0.299161 -0.106442 -0.391925 -0.168363 0.137203 0.139912 0.187644 0.228023 0.021127 -0.380508 0.156100 -0.260783 0.240092 -0.060640 0.229182 0.230523 0.231962 -0.204232 0.137540 0.138040 -0.006343 -0.175949 -0.224599 -0.134706 0.136116 -0.137012 0.161702 0.200209 0.117641 0.148031 -0.267323 0.218428
charge: 0.330118 -0.013444 -0.038704 -0.440488 0.042242 0.036924 0.112399 -0.373512 -0.015804 0.092449 0.356427 0.036126 0.034388 -0.021995 -0.387508 -0.036135 0.096874 0.035302 0.372926 -0.082041 0.616103 0.037962 0.048277 0.016132 0.001720 0.043460 0.043815 -0.119029 -0.001299 -0.020618 -0.005066 0.027759 0.008463 0.025931 -0.189450 0.024171 0.032578 0.373515 -0.100969
qa: -0.2039 0.1783 -0.0674 0.2918 0.1371 0.1406 -0.3163 0.2992 -0.1064 -0.3919 -0.1684 0.1372 0.1399 0.1876 0.2280 0.0211 -0.3805 0.1561 -0.2608 0.2401 -0.0606 0.2292 0.2305 0.2320 -0.2042 0.1375 0.1380 -0.0063 -0.1759 -0.2246 -0.1347 0.1361 -0.1370 0.1617 0.2002 0.1176 0.1480 -0.2673 0.2184
va: 3.2325 1.0150 3.7995 4.3338 1.0202 1.0041 2.1840 4.2151 3.8722 2.1278 3.2566 1.0004 1.0006 1.0507 4.2661 3.8141 2.1480 1.0001 2.2176 1.0163 3.6241 1.0088 0.9783 1.0372 3.8492 1.0108 1.0116 3.5461 4.0502 3.9666 3.9484 1.0041 4.0146 0.9970 4.0881 1.0067 1.0074 2.2341 1.0250
dispcorr: -0.078879572 hartree
energy: -1047.229176787445
dipole: 7.11746 -5.09952 2.01793 -1.32549 1.13404 -0.19145 2.74431 -3.20313 -0.45882
magnitude: 2.07827 au
magnitude: 5.28255 debye
zeropoint: 0.32331702 hartree
thermalvibcorrection: 0.01793068 hartree
thermalrotcorrection: 0.00141627 hartree
thermaltrasncorrection: 0.00141627 hartree
thermaltotal: -1046.88509655 hartree
thermalcorr: 0.02076322 hartree
nonthermalcorr: 0.32331702 hartree
totalcorr: 0.34408024 hartree
totalenthalpy: -1046.88415234 hartree
