program: Orca
programVersion: 5.0.2
elementType: N H C C H H O C C O N H H H C C O H O H N H H H C H H C C C C H C H C H H O H
charge: 1
multiplicity: 1
keywords: wB97X-D3BJ Opt Freq def2-TZVPP def2/J RIJCOSX VeryTightSCF
keywords: PAL8 defgrid3 VeryTightOpt
frequency: 0.00 0.00 0.00 0.00 0.00 0.00 45.97 50.43 56.74 66.82 86.22 90.73 97.57 124.89 144.02 161.87 163.84 203.41 216.74 239.46 274.83 302.94 316.13 328.41 361.62 366.55 390.60 400.48 415.16 439.93 456.25 470.80 492.09 497.66 539.10 558.08 578.92 604.97 630.16 642.12 662.51 701.37 718.68 745.87 755.23 782.00 806.40 852.18 856.62 871.16 880.26 881.93 906.95 936.47 941.95 991.87 1014.75 1028.69 1042.65 1046.67 1050.73 1099.99 1110.04 1127.99 1144.30 1155.38 1206.15 1209.42 1211.95 1234.24 1251.06 1270.13 1291.09 1296.70 1326.03 1332.82 1337.98 1364.66 1377.48 1383.46 1392.75 1399.13 1406.68 1437.13 1475.59 1491.57 1496.55 1499.33 1505.47 1580.42 1584.78 1599.63 1611.47 1659.65 1675.58 1702.41 1751.03 1802.01 1845.13 3072.42 3109.65 3120.31 3122.16 3133.83 3164.98 3167.42 3169.26 3176.46 3217.95 3223.07 3282.26 3443.48 3563.50 3650.40 3677.33 3809.09 3831.62
frequency: 45.97 50.43 56.74 66.82 86.22 90.73 97.57 124.89 144.02 161.87 163.84 203.41 216.74 239.46 274.83 302.94 316.13 328.41 361.62 366.55 390.60 400.48 415.16 439.93 456.25 470.80 492.09 497.66 539.10 558.08 578.92 604.97 630.16 642.12 662.51 701.37 718.68 745.87 755.23 782.00 806.40 852.18 856.62 871.16 880.26 881.93 906.95 936.47 941.95 991.87 1014.75 1028.69 1042.65 1046.67 1050.73 1099.99 1110.04 1127.99 1144.30 1155.38 1206.15 1209.42 1211.95 1234.24 1251.06 1270.13 1291.09 1296.70 1326.03 1332.82 1337.98 1364.66 1377.48 1383.46 1392.75 1399.13 1406.68 1437.13 1475.59 1491.57 1496.55 1499.33 1505.47 1580.42 1584.78 1599.63 1611.47 1659.65 1675.58 1702.41 1751.03 1802.01 1845.13 3072.42 3109.65 3120.31 3122.16 3133.83 3164.98 3167.42 3169.26 3176.46 3217.95 3223.07 3282.26 3443.48 3563.50 3650.40 3677.33 3809.09 3831.62
formula: C13H18N3O5
InChI: InChI=1S/C13H18N3O5/c14-10(5-8-1-3-9(17)4-2-8)13(21)16-6-11(18)15-7-12(19)20/h1-4,10,15-17,19H,5-7H2,14H3
39 atoms
N  -1.326892 1.709062 2.700953
H  -2.151475 2.101311 2.279906
C  -1.331233 1.531253 4.14504
C  0.029573 1.66384 4.80479
H  -1.974608 2.298569 4.579058
H  -1.724306 0.551856 4.41405
O  0.445552 0.881464 5.619648
C  -0.411258 1.133602 1.907912
C  -0.715922 1.13207 0.397834
O  0.607173 0.610191 2.346968
N  -0.077677 -0.0382 -0.178131
H  -0.301747 2.029547 -0.060205
H  -1.787946 1.103201 0.206779
H  -0.440955 -0.906791 0.178783
C  1.271067 0.015803 -0.276985
C  2.10158 -1.23699 0.08123
O  1.90132 1.025245 -0.522588
H  2.780609 -1.420458 -0.752079
O  0.665234 2.784711 4.450621
H  1.489554 2.829503 4.952928
N  2.93708 -0.651315 1.195852
H  3.643207 -1.292948 1.547484
H  3.368671 0.201999 0.828304
H  2.290752 -0.366899 1.95206
C  1.44347 -2.557166 0.518491
H  2.235963 -3.309991 0.567115
H  0.785367 -2.874042 -0.294172
C  0.695924 -2.497885 1.831276
C  1.386199 -2.422769 3.040772
C  -0.69586 -2.44602 1.878566
C  0.733459 -2.162233 4.2330
H  2.461082 -2.580013 3.069346
C  -1.369626 -2.199889 3.064537
H  -1.275815 -2.609019 0.973207
C  -0.648822 -1.9969 4.238579
H  1.291298 -2.073786 5.157699
H  -2.451325 -2.150762 3.094614
O  -1.336638 -1.658733 5.355344
H  -0.735992 -1.26104 5.995767
totalener: -1047.12145193 hartree
nucrepener: 1877.12438704 hartree
electener: -2924.24583897 hartree
oneelecener: -5138.69731088 hartree
twoeener: 2214.45147192 hartree
kineticenergy: 1042.00683557 hartree
exchangeener: -91.593494419051 hartree
correlationener: -6.622729407107 hartree
xcener: -98.216223826158 hartree
temp: 298.15 k
press: 1.00 atm
thermalcorrenthalpy: 0.00094421 hartree
totalenthalpy: -1046.86969892 hartree
totalentropycorr: -0.06202427 hartree
gibbsenthalpy: -1046.93172319 hartree
gibbsminuselec: 0.27972505 hartree
totalenthalpy: -1046.87320720 hartree
chargesum: 1.0000000
charge: -0.168137 0.182505 -0.108467 0.337061 0.152596 0.133726 -0.345288 0.325751 -0.079055 -0.477221 -0.163792 0.156284 0.129727 0.171218 0.184214 -0.003489 -0.340516 0.179887 -0.253065 0.232867 -0.077244 0.219906 0.240597 0.263914 -0.256486 0.146432 0.139402 0.120286 -0.277090 -0.209250 -0.073506 0.136279 -0.139573 0.150207 0.164818 0.119119 0.146659 -0.294153 0.232875
charge: 0.343999 -0.012938 -0.023089 -0.443064 0.041097 0.030153 0.110330 -0.365016 -0.021834 0.095713 0.332730 0.042983 0.028528 -0.031444 -0.383844 -0.030789 0.114899 0.044527 0.378728 -0.082778 0.613367 0.039148 0.048345 0.030732 -0.004006 0.041268 0.046260 -0.111428 -0.020919 -0.017173 0.002381 0.016428 0.002095 0.024929 -0.201387 0.028247 0.030193 0.365812 -0.103183
qa: -0.1681 0.1825 -0.1085 0.3371 0.1526 0.1337 -0.3453 0.3258 -0.0791 -0.4772 -0.1638 0.1563 0.1297 0.1712 0.1842 -0.0035 -0.3405 0.1799 -0.2531 0.2329 -0.0772 0.2199 0.2406 0.2639 -0.2565 0.1464 0.1394 0.1203 -0.2771 -0.2092 -0.0735 0.1363 -0.1396 0.1502 0.1648 0.1191 0.1467 -0.2942 0.2329
va: 3.2583 1.0087 3.8562 4.2489 0.9984 1.0289 2.1401 4.0564 3.8523 1.9908 3.2175 1.0123 1.0035 1.0551 4.3477 3.8815 2.1693 0.9991 2.2373 1.0230 3.6391 0.9830 0.9972 1.0031 3.8366 0.9983 1.0087 3.4099 4.0327 4.0016 3.9918 0.9950 3.9138 0.9932 4.0843 1.0117 1.0055 2.2069 1.0258
dispcorr: -0.091277483 hartree
energy: -1047.219477417278
dipole: 1.61227 -0.34701 1.26526 -4.37623 4.19946 -0.17677 -5.01164 3.67975 -1.33189
magnitude: 1.84555 au
magnitude: 4.69102 debye
zeropoint: 0.32548828 hartree
thermalvibcorrection: 0.01692383 hartree
thermalrotcorrection: 0.00141627 hartree
thermaltrasncorrection: 0.00141627 hartree
thermaltotal: -1046.87423277 hartree
thermalcorr: 0.01975637 hartree
nonthermalcorr: 0.32548828 hartree
totalcorr: 0.34524465 hartree
totalenthalpy: -1046.87328856 hartree
