program: Gaussian 09
title: 000047419
version: EM64L-G09RevD.01
frameworkgroup: C1[X(C20H22N4O10S)]
method: RPBEPBE
basis: SDD
operation: Freq
keyword: #p
keyword: freq=noraman
keyword: PBEPBE/SDD
title: #p freq=noraman PBEPBE/SDD
converged: YES YES NO NO
title: Mulliken charges:
elementType: S O O O O O O O O O O N N N N C C C C C C C C C C C C C C C C C C C C H H H H H H H H H H H H H H H H H H H H H H
charge: 0.219512 -0.132990 -0.268285 -0.292473 -0.205195 -0.280251 -0.252436 -0.209972 -0.216583 -0.300009 -0.210251 -0.171519 -0.367118 -0.057929 -0.616401 -0.485387 -0.180267 0.104750 0.155969 0.364517 -0.799133 -0.408820 0.168191 0.213664 -0.072607 0.080634 0.284383 0.333988 -0.723562 -0.331885 -0.273918 -0.157098 0.303946 -0.753451 -0.493266 0.326162 0.305584 0.278669 0.289664 0.354391 0.217054 0.267332 0.279363 0.235151 0.230939 0.289525 0.313520 0.257461 0.336161 0.341124 0.263810 0.251237 0.248720 0.247388 0.232009 0.230931 0.235058
chargesum: 0.00000
title: Mulliken charges with hydrogens summed into heavy atoms:
elementType: S O O O O O O O O O O N N N N C C C C C C C C C C C C C C C C C C C C
charge: 0.219512 -0.132990 -0.268285 -0.292473 -0.205195 -0.280251 -0.252436 -0.209972 -0.216583 -0.300009 -0.210251 -0.171519 -0.012727 -0.057929 0.060884 -0.159225 0.125317 0.104750 0.155969 0.364517 -0.230800 0.075566 0.168191 0.213664 -0.072607 0.359997 0.284383 0.333988 0.032053 -0.018365 -0.016457 0.106712 0.303946 -0.006106 0.204732
polarizability: 4.24284797e+02 -1.29751105e+00 2.44643675e+02 -3.34180562e+01 2.31897615e+01 2.81436190e+02
1716.lowfreq: -3.5406 -0.0009 0.0008 0.0012 1.9899 8.4584 10.1551 14.1107 15.0845
frequency: 10.0064 14.0593 14.9054 20.8099 29.7397 37.4249 40.1208 44.2843 48.7516 51.0477 56.3726 68.4837 72.6978 80.1664 82.5514 89.0669 94.3411 112.1930 119.0855 121.1824 133.2300 137.8551 154.3204 174.4476 179.3143 192.6694 193.8924 204.1485 218.9646 231.3961 247.4625 258.5964 269.3291 276.5053 290.7878 301.6217 318.2345 335.2966 356.7859 364.1550 405.3169 406.8662 417.8604 427.9141 445.5999 474.3179 485.5374 488.9756 497.8846 514.8750 517.4785 546.9828 559.3515 566.5991 585.1329 587.7141 618.0906 619.5182 648.9175 653.6325 673.3957 697.5457 699.1629 720.0332 723.6035 738.4462 744.4934 747.5690 755.5402 773.4015 791.1731 791.5371 803.3359 813.1083 843.8995 869.9178 876.4639 879.7750 894.3883 906.2129 910.3236 910.9896 934.6823 954.9045 968.5791 971.2831 982.9720 1002.4704 1003.9848 1014.9031 1038.5876 1043.3995 1053.2160 1054.7177 1059.0998 1084.4520 1093.8087 1108.1772 1136.5577 1150.3774 1152.8038 1156.0687 1167.8539 1174.9039 1176.7985 1188.1278 1198.3433 1206.4432 1213.0562 1225.8885 1232.2054 1251.4535 1276.6160 1278.5701 1293.8786 1321.8461 1323.6676 1337.3253 1366.0285 1368.1583 1382.3379 1383.3925 1403.3835 1416.2876 1420.4003 1439.7240 1449.2799 1452.0390 1453.2507 1467.8072 1468.5830 1477.3364 1478.2039 1479.4539 1497.3851 1577.5624 1586.3815 1608.8364 1616.0387 1638.6045 1681.7212 1686.3723 1740.1947 2990.0729 2993.0887 3000.1494 3001.7245 3006.7970 3049.3466 3058.6067 3061.6785 3074.3967 3095.4631 3096.0162 3104.1816 3115.6589 3116.5982 3133.0956 3145.1113 3227.4051 3256.4846 3267.6232 3473.8876 3558.0274 3716.3192
redmass: 5.1851 6.6546 6.2292 6.6096 7.3999 7.2105 5.8775 5.0474 6.2148 4.3797 5.3634 4.8076 6.7164 1.3708 1.6607 6.0343 6.6977 7.0474 4.5222 3.0845 2.5391 4.8916 5.3136 4.1374 7.8793 4.7669 5.1322 5.9056 6.0487 5.5602 6.7703 1.2570 4.5517 5.7366 4.7737 7.4612 4.1838 5.1786 3.6583 3.4091 8.1719 7.9153 5.0034 4.6565 3.7502 4.5802 2.1865 1.7298 4.6432 7.0983 1.0882 4.2962 3.9056 4.4607 6.6492 3.0036 5.6587 5.5204 6.1616 6.2864 5.6475 8.3712 8.0520 2.6089 1.7339 5.1214 7.9859 1.2621 6.6025 6.2022 6.1091 5.7878 4.0806 3.6472 1.3149 6.4260 2.5397 4.2004 4.7833 4.4916 3.6496 1.3787 3.2210 3.6661 5.3967 6.8773 2.2965 3.1344 2.9888 4.5253 2.5373 1.6712 2.1253 2.3321 2.0225 2.3171 2.9228 1.2512 1.6753 1.5581 1.5443 2.4034 2.6008 1.5462 2.1403 2.7119 1.7941 1.6861 1.9403 1.4666 1.2707 1.3559 2.1203 5.1254 2.4678 1.6132 1.3991 1.2585 2.6665 1.7669 1.2521 5.0255 1.2593 1.2113 1.0910 5.3337 1.0526 1.0545 1.0500 1.0789 1.0400 2.0067 1.0539 1.1259 4.8334 8.6950 1.2120 9.2517 10.5587 8.7673 9.7634 7.5600 12.8515 1.0290 1.0614 1.0661 1.0355 1.0371 1.0837 1.0876 1.1008 1.0893 1.1056 1.0964 1.0993 1.1020 1.0955 1.1032 1.1013 1.0916 1.0981 1.1092 1.0776 1.0444 1.1060
irintensity: 0.0213 0.1953 0.7233 0.0243 0.2390 1.0930 0.8333 3.6233 2.3474 0.8149 9.1277 3.3281 1.4204 0.5672 2.4398 5.8458 0.3359 2.1623 1.0869 1.8515 1.1242 1.6845 2.6129 6.5586 1.6578 3.3790 0.9881 12.2568 6.2610 0.4546 14.1064 1.2969 3.8339 9.5757 2.1366 11.0020 4.5951 9.9048 15.9800 37.3053 4.0752 3.0474 2.5443 14.6844 8.3802 15.2793 105.9318 192.7919 12.5936 13.5040 21.6001 11.7322 4.2182 21.1187 7.3597 7.6157 1.9299 3.4792 9.1147 1.7513 4.2152 27.5699 22.8232 33.6154 27.0065 27.1468 6.3473 81.9989 7.7009 45.2147 27.9324 58.5396 9.8995 15.0884 24.2250 18.4319 49.0857 10.8484 18.3236 123.7393 34.5659 6.8672 13.8111 18.9576 49.2149 413.9329 97.3066 146.9860 152.5671 89.1951 19.7246 14.8910 91.1172 51.4849 12.1964 290.4728 27.6274 0.2070 17.4613 24.0289 41.8188 30.6402 98.4466 34.2857 66.6166 170.8464 4.8889 2.8918 62.0194 25.8964 38.7524 18.5980 250.0537 23.7581 333.3371 105.1532 8.1434 9.6123 2.2021 85.3821 54.2839 87.5460 42.8682 6.4758 15.0058 10.4267 14.3073 26.4251 19.8348 86.6837 11.0735 646.8163 3.3428 83.3732 1.3661 46.6966 110.8321 139.0315 147.7994 85.2732 138.0801 343.0496 434.6479 71.4612 6.7199 54.2251 13.5339 1.8460 40.3206 3.3324 1.2502 13.5408 33.6051 7.3292 18.8396 1.0435 4.8797 16.1168 8.0944 2.8808 6.0323 2.9213 51.3308 62.3619 48.7908
temp: 298.150 k
press: 1.00000 atm
elementType: 16 8 8 8 8 8 8 8 8 8 8 7 7 7 7 6 6 6 6 6 6 6 6 6 6 6 6 6 6 6 6 6 6 6 6 1 1 1 1 1 1 1 1 1 1 1 1 1 1 1 1 1 1 1 1 1 1
symmnumber: 1
zpe: 1088552.1 jmol-1
zpe.correction: 0.414608 hartree
zpe.thermalcorrener: 0.450923 hartree
zpe.thermalcorrenthalpy: 0.451867 hartree
zpe.thermalcorrgfe: 0.338983 hartree
zpe.sumelectzpe: -2141.964065 hartree
zpe.sumelectthermal: -2141.927750 hartree
zpe.sumelectthermalent: -2141.926806 hartree
zpe.sumelectthermalfe: -2142.039689 hartree
dipole: -1.7023 -0.7337 6.9857
dipole: 7.2275
quadrupole: -176.6884 -200.0957 -198.6291
quadrupole: -6.1759 -9.3364 17.3573
quadrupole: 15.1160 -8.2913 -6.8247 -6.1759 -9.3364 17.3573
hfenergy: -2142.3786727 hartree
pointgroup: C01 [X(C20H22N4O10S1)]
dipole: -0.408628 0.6172677 -2.7454616 debye
polarizability: 416.0431082|1.3906143|239.3350462|46.1698524|19.0987662|294.9865075 unknown
InChI: InChI=1S/C20H22N4O10S/c1-9(25)33-10(2)34-19(28)15-11(7-32-20(21)29)8-35-18-14(17(27)24(15)18)22-16(26)13(23-30-3)12-5-4-6-31-12/h4-6,10,14,18,22H,7-8,21H2,1-3H3
charge 0 multiplicity 1
57 atoms
S  0.735746 2.130742 -0.866236
O  0.033807 -1.549861 1.708137
O  -3.813867 -0.477073 0.302426
O  -3.716734 1.57781 -2.176785
O  -2.916194 -0.321735 2.457771
O  4.208499 0.839781 2.344301
O  -5.202759 -2.230201 -0.370251
O  7.423066 -0.591259 -0.187848
O  5.418945 -1.266273 -1.777409
O  -5.992648 1.198613 -1.657581
O  -3.354996 -3.619261 0.028623
N  -0.58011 0.755016 1.151795
N  2.647796 0.179488 0.74735
N  4.479203 -0.738823 -0.837427
N  -5.01895 0.445456 -3.655155
C  0.537943 1.701027 0.966188
C  1.51585 0.596777 1.527125
C  0.257247 -0.34802 1.526348
C  -1.87351 0.89197 0.615035
C  -2.132087 1.845948 -0.343958
C  -1.065837 2.717554 -0.990887
C  -3.527833 2.175547 -0.81879
C  -2.896667 -0.01667 1.245151
C  3.94394 0.312767 1.221496
C  5.012248 -0.22686 0.272488
C  -4.867337 -1.428595 0.797747
C  6.400775 -0.119368 0.682963
C  -5.010468 1.073363 -2.430064
C  -6.107221 -0.666344 1.227308
C  7.000535 0.386877 1.844273
C  8.421649 0.229453 1.699845
C  8.637569 -0.362914 0.462691
C  -4.324509 -3.305726 -0.684403
C  -4.76676 -3.951379 -1.975424
C  4.665294 -1.806623 -2.929152
H  0.443046 2.631649 1.545571
H  1.873764 0.845448 2.541532
H  -1.110506 3.749092 -0.592958
H  -1.269261 2.770542 -2.07597
H  2.53957 -0.267533 -0.170607
H  -3.647483 3.269789 -0.937339
H  -4.320542 1.797987 -0.157626
H  -4.402596 -2.048731 1.584894
H  -5.873146 -0.041733 2.105989
H  -6.900858 -1.379527 1.508794
H  -6.463702 -0.030162 0.400324
H  6.451001 0.812003 2.679033
H  9.185521 0.516685 2.419173
H  -4.167258 0.377212 -4.206569
H  -5.892866 0.052263 -3.992331
H  9.524298 -0.674566 -0.082689
H  -5.842726 -4.190589 -1.936897
H  -4.179883 -4.86286 -2.157328
H  -4.616496 -3.242157 -2.809028
H  5.442859 -2.187973 -3.608731
H  4.080309 -1.00728 -3.416227
H  3.99823 -2.623463 -2.603804
