program: Orca
programVersion: 5.0.2
elementType: N H C C H H O C C O N H H H C C O H O H N H H H C H H C C C C H C H C H H O H
charge: 1
multiplicity: 1
keywords: wB97X-D3BJ Opt Freq def2-TZVPP def2/J RIJCOSX VeryTightSCF
keywords: PAL8 defgrid3 VeryTightOpt
frequency: 0.00 0.00 0.00 0.00 0.00 0.00 27.57 28.22 35.23 55.78 63.64 66.72 71.67 93.06 98.43 134.58 160.92 198.31 208.44 248.05 271.59 284.75 310.91 312.00 359.82 365.77 383.63 388.43 428.43 431.80 433.28 459.86 478.64 493.62 513.72 523.26 544.45 568.39 617.93 645.37 658.65 668.98 693.01 705.15 747.46 757.99 830.09 851.40 861.65 875.00 886.34 890.65 919.46 923.33 969.59 981.06 1012.19 1038.17 1041.75 1054.81 1067.98 1094.11 1109.12 1141.37 1157.07 1169.73 1196.05 1206.70 1208.85 1244.83 1251.70 1260.23 1271.19 1283.06 1304.69 1333.01 1334.49 1343.65 1347.19 1366.25 1368.62 1398.43 1420.67 1462.87 1473.29 1475.34 1491.98 1498.21 1500.95 1566.49 1579.75 1581.12 1609.38 1671.92 1679.63 1700.92 1782.83 1791.28 1833.91 3084.15 3085.67 3124.15 3127.46 3139.51 3141.82 3184.06 3184.42 3184.44 3205.19 3231.39 3314.91 3386.77 3473.39 3678.89 3699.56 3805.16 3876.16
frequency: 27.57 28.22 35.23 55.78 63.64 66.72 71.67 93.06 98.43 134.58 160.92 198.31 208.44 248.05 271.59 284.75 310.91 312.00 359.82 365.77 383.63 388.43 428.43 431.80 433.28 459.86 478.64 493.62 513.72 523.26 544.45 568.39 617.93 645.37 658.65 668.98 693.01 705.15 747.46 757.99 830.09 851.40 861.65 875.00 886.34 890.65 919.46 923.33 969.59 981.06 1012.19 1038.17 1041.75 1054.81 1067.98 1094.11 1109.12 1141.37 1157.07 1169.73 1196.05 1206.70 1208.85 1244.83 1251.70 1260.23 1271.19 1283.06 1304.69 1333.01 1334.49 1343.65 1347.19 1366.25 1368.62 1398.43 1420.67 1462.87 1473.29 1475.34 1491.98 1498.21 1500.95 1566.49 1579.75 1581.12 1609.38 1671.92 1679.63 1700.92 1782.83 1791.28 1833.91 3084.15 3085.67 3124.15 3127.46 3139.51 3141.82 3184.06 3184.42 3184.44 3205.19 3231.39 3314.91 3386.77 3473.39 3678.89 3699.56 3805.16 3876.16
formula: C13H18N3O5
InChI: InChI=1S/C13H18N3O5/c14-10(5-8-1-3-9(17)4-2-8)13(21)16-6-11(18)15-7-12(19)20/h1-4,10,15-17,19H,5-7H2,14H3
39 atoms
N  -0.083251 1.018084 -2.563366
H  -0.031798 0.03547 -2.366576
C  0.578904 1.474672 -3.752294
C  1.912873 0.785397 -3.937519
H  -0.012028 1.307797 -4.657422
H  0.74056 2.551598 -3.670507
O  2.356457 -0.0811 -3.206517
C  -0.35264 1.872609 -1.528332
C  -0.699323 1.188821 -0.198646
O  -0.343411 3.074298 -1.633355
N  0.040299 -0.055021 -0.016372
H  -1.766411 0.970369 -0.165068
H  -0.460627 1.900683 0.588893
H  -0.442997 -0.936524 -0.005063
C  1.383919 -0.017024 -0.01228
C  2.139645 -1.347295 -0.06455
O  2.030904 1.01587 0.000961
H  1.622156 -2.093645 -0.667371
O  2.542336 1.215036 -5.019266
H  3.376038 0.736567 -5.122138
N  3.4080 -1.003575 -0.776184
H  4.114202 -1.724854 -0.613441
H  3.228376 -0.849613 -1.779405
H  3.708961 -0.095132 -0.399414
C  2.465885 -1.896216 1.331694
H  1.529506 -2.223246 1.788565
H  2.855169 -1.081169 1.946947
C  3.464968 -3.025184 1.255189
C  4.789422 -2.831187 1.636514
C  3.096912 -4.27568 0.749461
C  5.728532 -3.849697 1.519544
H  5.096963 -1.87849 2.05722
C  4.018201 -5.297394 0.626583
H  2.066112 -4.462292 0.463272
C  5.344336 -5.087255 1.0129
H  6.752728 -3.683121 1.835598
H  3.732365 -6.270656 0.248093
O  6.197965 -6.125761 0.871182
H  7.070376 -5.897655 1.202732
totalener: -1047.14337050 hartree
nucrepener: 1700.81281453 hartree
electener: -2747.95618504 hartree
oneelecener: -4785.40189292 hartree
twoeener: 2037.44570788 hartree
kineticenergy: 1041.99818021 hartree
exchangeener: -91.593665487219 hartree
correlationener: -6.613954761348 hartree
xcener: -98.207620248567 hartree
temp: 298.15 k
press: 1.00 atm
thermalcorrenthalpy: 0.00094421 hartree
totalenthalpy: -1046.88379444 hartree
totalentropycorr: -0.06408419 hartree
gibbsenthalpy: -1046.94787863 hartree
gibbsminuselec: 0.27753126 hartree
totalenthalpy: -1046.88568050 hartree
chargesum: 1.0000000
charge: -0.181541 0.140738 -0.066805 0.370688 0.148376 0.145155 -0.438438 0.242740 -0.073957 -0.314250 -0.223377 0.135196 0.147667 0.195534 0.185479 0.035324 -0.353366 0.145947 -0.221857 0.237673 -0.078582 0.234064 0.249944 0.226165 -0.173310 0.131539 0.138532 -0.015541 -0.232828 -0.152815 -0.128541 0.146667 -0.138513 0.125679 0.196967 0.119355 0.144425 -0.268571 0.218437
charge: 0.317516 -0.044875 -0.035135 -0.397983 0.040859 0.051014 0.076140 -0.388789 -0.014591 0.123569 0.338025 0.035095 0.042721 -0.021757 -0.399042 -0.049904 0.119588 0.034070 0.410243 -0.075352 0.618094 0.038709 0.002780 0.040879 0.003304 0.042169 0.043918 -0.118602 -0.016623 -0.005020 -0.014129 0.026035 0.013940 0.025556 -0.189751 0.023069 0.032597 0.372626 -0.100962
qa: -0.1815 0.1407 -0.0668 0.3707 0.1484 0.1452 -0.4384 0.2427 -0.0740 -0.3142 -0.2234 0.1352 0.1477 0.1955 0.1855 0.0353 -0.3534 0.1459 -0.2219 0.2377 -0.0786 0.2341 0.2499 0.2262 -0.1733 0.1315 0.1385 -0.0155 -0.2328 -0.1528 -0.1285 0.1467 -0.1385 0.1257 0.1970 0.1194 0.1444 -0.2686 0.2184
va: 3.1097 1.0531 3.8287 4.2138 1.0013 1.0365 2.0293 4.2435 3.7740 2.2228 3.1830 0.9950 1.0210 1.0015 4.2951 3.8416 2.1632 1.0098 2.2861 1.0197 3.6442 0.9885 1.0254 1.0160 3.8263 1.0104 1.0162 3.5574 4.0016 4.0375 3.9332 1.0038 4.0098 1.0045 4.0935 1.0060 1.0088 2.2336 1.0248
dispcorr: -0.082520416 hartree
energy: -1047.231029949210
dipole: 0.49283 0.29409 0.78692 -4.66426 2.95885 -1.70542 3.51648 -3.85988 -0.34340
magnitude: 1.90935 au
magnitude: 4.85318 debye
zeropoint: 0.32390748 hartree
thermalvibcorrection: 0.01766374 hartree
thermalrotcorrection: 0.00141627 hartree
thermaltrasncorrection: 0.00141627 hartree
thermaltotal: -1046.88662618 hartree
thermalcorr: 0.02049629 hartree
nonthermalcorr: 0.32390748 hartree
totalcorr: 0.34440377 hartree
totalenthalpy: -1046.88568197 hartree
