program: Orca
programVersion: 5.0.2
elementType: N H C C H H O C C O N H H H C C O H O H N H H H C H H C C C C H C H C H H O H
charge: 1
multiplicity: 1
keywords: wB97X-D3BJ Opt Freq def2-TZVPP def2/J RIJCOSX VeryTightSCF
keywords: PAL8 defgrid3 VeryTightOpt
frequency: 0.00 0.00 0.00 0.00 0.00 0.00 27.88 33.47 41.51 53.90 59.29 65.98 78.34 84.82 100.14 136.18 160.74 207.43 224.90 277.42 282.72 292.59 301.63 317.75 334.58 366.67 381.88 398.14 427.09 429.74 436.74 470.81 493.37 509.08 529.35 544.64 569.67 600.25 641.67 655.75 658.88 690.74 705.01 730.33 746.09 755.75 802.49 846.15 861.75 879.61 880.70 892.22 903.69 953.25 967.06 987.09 1029.95 1039.91 1042.16 1052.88 1060.99 1099.73 1115.21 1135.94 1143.56 1161.22 1190.40 1198.24 1207.43 1227.15 1249.50 1266.98 1289.32 1304.42 1316.18 1331.24 1333.16 1335.25 1355.92 1367.32 1380.63 1396.52 1403.00 1436.19 1445.15 1464.04 1476.28 1493.37 1500.70 1578.86 1581.49 1614.77 1639.30 1665.87 1672.47 1700.23 1765.34 1796.27 1852.94 2865.53 3057.39 3115.83 3118.91 3119.40 3142.33 3170.04 3171.41 3177.02 3202.21 3225.08 3238.95 3512.30 3583.18 3588.24 3677.69 3807.73 3878.51
frequency: 27.88 33.47 41.51 53.90 59.29 65.98 78.34 84.82 100.14 136.18 160.74 207.43 224.90 277.42 282.72 292.59 301.63 317.75 334.58 366.67 381.88 398.14 427.09 429.74 436.74 470.81 493.37 509.08 529.35 544.64 569.67 600.25 641.67 655.75 658.88 690.74 705.01 730.33 746.09 755.75 802.49 846.15 861.75 879.61 880.70 892.22 903.69 953.25 967.06 987.09 1029.95 1039.91 1042.16 1052.88 1060.99 1099.73 1115.21 1135.94 1143.56 1161.22 1190.40 1198.24 1207.43 1227.15 1249.50 1266.98 1289.32 1304.42 1316.18 1331.24 1333.16 1335.25 1355.92 1367.32 1380.63 1396.52 1403.00 1436.19 1445.15 1464.04 1476.28 1493.37 1500.70 1578.86 1581.49 1614.77 1639.30 1665.87 1672.47 1700.23 1765.34 1796.27 1852.94 2865.53 3057.39 3115.83 3118.91 3119.40 3142.33 3170.04 3171.41 3177.02 3202.21 3225.08 3238.95 3512.30 3583.18 3588.24 3677.69 3807.73 3878.51
formula: C13H18N3O5
InChI: InChI=1S/C13H18N3O5/c14-10(5-8-1-3-9(17)4-2-8)13(21)16-6-11(18)15-7-12(19)20/h1-4,10,15-17,19H,5-7H2,14H3
39 atoms
N  -1.492639 1.936569 2.730413
H  -2.288753 2.276907 2.21926
C  -1.598843 1.844474 4.165504
C  -2.184769 0.508578 4.600363
H  -0.614614 1.950351 4.621477
H  -2.228262 2.649115 4.545481
O  -2.553946 -0.358501 3.853793
C  -0.591143 1.16727 2.080653
C  -0.716192 1.155508 0.549615
O  0.281966 0.536386 2.64705
N  -0.003604 0.00942 0.02552
H  -0.281879 2.070896 0.147621
H  -1.75915 1.097882 0.239832
H  -0.455211 -0.887802 0.138528
C  1.329711 0.008728 0.048256
C  2.039236 -1.362356 -0.00838
O  2.037258 1.011511 0.092184
H  1.858301 -1.836227 -0.97295
O  -2.238722 0.428457 5.934297
H  -2.626276 -0.424601 6.171211
N  3.490715 -0.972451 0.057205
H  4.036638 -1.291801 -0.738069
H  3.418235 0.088015 0.069083
H  3.931847 -1.297866 0.915064
C  1.675014 -2.312198 1.142321
H  1.758574 -1.766708 2.085531
H  2.407893 -3.125876 1.149174
C  0.281709 -2.882109 1.001568
C  -0.027632 -3.757747 -0.036797
C  -0.729869 -2.524975 1.895446
C  -1.311929 -4.256841 -0.192944
H  0.741751 -4.072498 -0.736069
C  -2.017996 -3.010204 1.748583
H  -0.516859 -1.839279 2.706293
C  -2.313904 -3.88075 0.701062
H  -1.53444 -4.942338 -1.003814
H  -2.798061 -2.717673 2.439627
O  -3.588796 -4.32598 0.602584
H  -3.676529 -4.938368 -0.132182
totalener: -1047.13958636 hartree
nucrepener: 1769.64898112 hartree
electener: -2816.78856748 hartree
oneelecener: -4924.86763676 hartree
twoeener: 2108.07906928 hartree
kineticenergy: 1041.99854200 hartree
exchangeener: -91.591381752464 hartree
correlationener: -6.615674703914 hartree
xcener: -98.207056456378 hartree
temp: 298.15 k
press: 1.00 atm
thermalcorrenthalpy: 0.00094421 hartree
totalenthalpy: -1046.88276921 hartree
totalentropycorr: -0.06370342 hartree
gibbsenthalpy: -1046.94647263 hartree
gibbsminuselec: 0.27705897 hartree
chargesum: 1.0000000
charge: -0.203796 0.175645 -0.063342 0.299610 0.134447 0.142195 -0.333173 0.299112 -0.085806 -0.404564 -0.188125 0.150644 0.133508 0.202257 0.246220 -0.013478 -0.358844 0.161628 -0.254768 0.238738 -0.058257 0.231590 0.228674 0.227062 -0.176001 0.140463 0.133332 -0.031312 -0.183138 -0.197096 -0.139890 0.119519 -0.120091 0.152233 0.192385 0.111311 0.146483 -0.270487 0.215110
charge: 0.331339 -0.017511 -0.039800 -0.435315 0.042475 0.038295 0.109403 -0.381076 -0.023611 0.087779 0.355592 0.040704 0.031312 -0.011533 -0.355757 -0.030662 0.136104 0.037198 0.376596 -0.082189 0.607106 0.040584 -0.010765 0.044884 -0.005581 0.043503 0.033020 -0.116153 -0.012425 0.000750 -0.015292 0.022460 0.006687 0.026558 -0.190918 0.020929 0.031568 0.368068 -0.104328
qa: -0.2038 0.1756 -0.0633 0.2996 0.1344 0.1422 -0.3332 0.2991 -0.0858 -0.4046 -0.1881 0.1506 0.1335 0.2023 0.2462 -0.0135 -0.3588 0.1616 -0.2548 0.2387 -0.0583 0.2316 0.2287 0.2271 -0.1760 0.1405 0.1333 -0.0313 -0.1831 -0.1971 -0.1399 0.1195 -0.1201 0.1522 0.1924 0.1113 0.1465 -0.2705 0.2151
va: 3.2345 1.0155 3.8038 4.2990 1.0185 1.0047 2.1536 4.1662 3.8291 2.1027 3.3152 1.0073 1.0021 1.0183 4.2784 3.8431 2.1737 0.9993 2.2250 1.0178 3.6044 0.9761 1.0576 0.9815 3.8489 1.0129 0.9959 3.6751 4.0366 3.9716 3.9427 1.0072 3.9447 1.0150 4.0859 1.0088 1.0253 2.2293 1.0270
dispcorr: -0.084497225 hartree
energy: -1047.229260458162
dipole: 7.57003 -4.66585 2.90418 -1.78411 1.51441 -0.26970 -5.25119 3.21128 -2.03991
magnitude: 3.55924 au
magnitude: 9.04688 debye
zeropoint: 0.32387825 hartree
thermalvibcorrection: 0.01744522 hartree
thermalrotcorrection: 0.00141627 hartree
thermaltrasncorrection: 0.00141627 hartree
thermaltotal: -1046.88510444 hartree
thermalcorr: 0.02027776 hartree
nonthermalcorr: 0.32387825 hartree
totalcorr: 0.34415602 hartree
totalenthalpy: -1046.88416023 hartree
