program: Orca
programVersion: 5.0.2
elementType: N H C C H H O C C O N H H H C C O H O H N H H H C H H C C C C H C H C H H O H
charge: 1
multiplicity: 1
keywords: wB97X-D3BJ Opt Freq def2-TZVPP def2/J RIJCOSX VeryTightSCF
keywords: PAL8 defgrid3 VeryTightOpt
frequency: 0.00 0.00 0.00 0.00 0.00 0.00 6.88 17.76 34.35 36.84 60.67 63.49 73.87 83.25 102.21 109.57 169.95 180.45 190.55 214.28 231.48 293.95 304.92 327.05 353.85 382.97 387.08 405.70 431.35 436.43 438.88 478.71 514.73 524.35 546.85 570.94 579.81 622.04 634.03 640.74 660.08 664.48 669.94 716.38 743.99 748.80 825.58 855.43 867.76 883.50 891.23 914.61 929.33 975.98 984.37 1005.99 1018.01 1024.17 1034.66 1042.25 1054.89 1110.93 1125.38 1135.88 1148.64 1170.73 1193.19 1207.26 1209.55 1226.86 1249.82 1253.08 1257.70 1265.68 1293.84 1325.69 1333.89 1335.43 1345.81 1373.78 1381.50 1394.37 1406.39 1448.68 1466.47 1497.12 1498.75 1503.63 1507.84 1581.29 1588.10 1603.36 1609.27 1670.08 1677.51 1700.87 1764.60 1779.94 1851.57 3037.95 3090.68 3091.61 3093.51 3126.21 3131.79 3138.34 3138.98 3168.65 3202.76 3204.50 3231.74 3370.42 3567.39 3572.83 3615.42 3802.15 3876.69
frequency: 6.88 17.76 34.35 36.84 60.67 63.49 73.87 83.25 102.21 109.57 169.95 180.45 190.55 214.28 231.48 293.95 304.92 327.05 353.85 382.97 387.08 405.70 431.35 436.43 438.88 478.71 514.73 524.35 546.85 570.94 579.81 622.04 634.03 640.74 660.08 664.48 669.94 716.38 743.99 748.80 825.58 855.43 867.76 883.50 891.23 914.61 929.33 975.98 984.37 1005.99 1018.01 1024.17 1034.66 1042.25 1054.89 1110.93 1125.38 1135.88 1148.64 1170.73 1193.19 1207.26 1209.55 1226.86 1249.82 1253.08 1257.70 1265.68 1293.84 1325.69 1333.89 1335.43 1345.81 1373.78 1381.50 1394.37 1406.39 1448.68 1466.47 1497.12 1498.75 1503.63 1507.84 1581.29 1588.10 1603.36 1609.27 1670.08 1677.51 1700.87 1764.60 1779.94 1851.57 3037.95 3090.68 3091.61 3093.51 3126.21 3131.79 3138.34 3138.98 3168.65 3202.76 3204.50 3231.74 3370.42 3567.39 3572.83 3615.42 3802.15 3876.69
formula: C13H18N3O5
InChI: InChI=1S/C13H18N3O5/c14-10(5-8-1-3-9(17)4-2-8)13(21)16-6-11(18)15-7-12(19)20/h1-4,10,15-17,19H,5-7H2,14H3
39 atoms
N  -3.059578 1.679679 1.184144
H  -2.907651 2.642405 0.918587
C  -4.330085 1.388942 1.809902
C  -5.112107 2.680222 1.903003
H  -4.902752 0.659645 1.232562
H  -4.198233 0.973226 2.811335
O  -4.703639 3.740557 1.506573
C  -2.15028 0.728004 0.952545
C  -0.859473 1.191311 0.273374
O  -2.301584 -0.450222 1.249291
N  -0.050446 0.005113 0.082968
H  -0.328281 1.908321 0.902001
H  -1.082292 1.677623 -0.678963
H  -0.562864 -0.853006 0.248387
C  1.274187 0.029539 0.076158
C  1.997896 -1.334305 0.013737
O  1.964035 1.046116 0.07781
H  1.899814 -1.720604 -1.001977
O  -6.30126 2.491846 2.476439
H  -6.759224 3.342869 2.509736
N  3.43181 -0.954134 0.223051
H  3.415033 0.089515 0.101875
H  3.700718 -1.160868 1.192587
H  4.077065 -1.401777 -0.420949
C  1.556493 -2.384956 1.044868
H  2.037222 -3.333702 0.795577
H  0.483733 -2.5511 0.934887
C  1.904459 -1.975492 2.454645
C  3.08369 -2.421699 3.048104
C  1.082892 -1.108978 3.182874
C  3.454924 -2.005135 4.321836
H  3.712007 -3.142781 2.530883
C  1.437117 -0.691201 4.450502
H  0.13746 -0.781036 2.764359
C  2.631571 -1.131948 5.025263
H  4.369913 -2.376089 4.770903
H  0.79646 -0.032531 5.023133
O  2.918338 -0.683917 6.267847
H  3.737116 -1.07003 6.589557
totalener: -1047.14424917 hartree
nucrepener: 1669.11939514 hartree
electener: -2716.26364431 hartree
oneelecener: -4722.98645939 hartree
twoeener: 2006.72281508 hartree
kineticenergy: 1041.98178883 hartree
exchangeener: -91.591446393994 hartree
correlationener: -6.614494783776 hartree
xcener: -98.205941177769 hartree
temp: 298.15 k
press: 1.00 atm
thermalcorrenthalpy: 0.00094421 hartree
totalenthalpy: -1046.88416508 hartree
totalentropycorr: -0.06438533 hartree
gibbsenthalpy: -1046.94855042 hartree
gibbsminuselec: 0.27623270 hartree
totalenthalpy: -1046.88595464 hartree
chargesum: 1.0000000
charge: -0.196047 0.185466 -0.058029 0.302858 0.134344 0.131043 -0.322648 0.282949 -0.100155 -0.406386 -0.167284 0.142873 0.143104 0.184811 0.240290 -0.012331 -0.373847 0.156662 -0.254039 0.242776 -0.055915 0.229213 0.223355 0.228917 -0.223881 0.139697 0.134104 0.069199 -0.280956 -0.145159 -0.121014 0.161414 -0.112933 0.107172 0.179346 0.120033 0.141118 -0.267771 0.217649
charge: 0.337534 -0.017527 -0.028437 -0.433411 0.039904 0.038723 0.115266 -0.388021 -0.016991 0.069584 0.355621 0.036760 0.033619 -0.027420 -0.376243 -0.031254 0.113375 0.040394 0.381629 -0.077058 0.613484 0.003127 0.038123 0.038768 -0.000904 0.039688 0.042210 -0.113538 -0.026716 0.008338 -0.014834 0.022886 0.018125 0.026522 -0.188234 0.022513 0.032410 0.373201 -0.101216
qa: -0.1960 0.1855 -0.0580 0.3029 0.1343 0.1310 -0.3226 0.2829 -0.1002 -0.4064 -0.1673 0.1429 0.1431 0.1848 0.2403 -0.0123 -0.3738 0.1567 -0.2540 0.2428 -0.0559 0.2292 0.2234 0.2289 -0.2239 0.1397 0.1341 0.0692 -0.2810 -0.1452 -0.1210 0.1614 -0.1129 0.1072 0.1793 0.1200 0.1411 -0.2678 0.2176
va: 3.2086 1.0375 3.8565 4.3239 1.0078 1.0079 2.1684 4.2010 3.8584 2.0993 3.2661 1.0077 0.9994 1.0476 4.2447 3.9295 2.1541 0.9962 2.2376 1.0142 3.5800 1.0450 1.0190 0.9773 3.8901 1.0044 1.0106 3.4863 4.0070 4.0362 3.9610 0.9994 3.9878 1.0365 4.1138 1.0057 1.0073 2.2349 1.0253
dispcorr: -0.080785976 hartree
energy: -1047.230791316360
dipole: 9.94536 -6.68261 3.26275 -7.55945 5.88991 -1.66954 -3.79263 2.11901 -1.67362
magnitude: 4.02913 au
magnitude: 10.24124 debye
zeropoint: 0.32331188 hartree
thermalvibcorrection: 0.01773792 hartree
thermalrotcorrection: 0.00141627 hartree
thermaltrasncorrection: 0.00141627 hartree
thermaltotal: -1046.88690897 hartree
thermalcorr: 0.02057046 hartree
nonthermalcorr: 0.32331188 hartree
totalcorr: 0.34388235 hartree
totalenthalpy: -1046.88596476 hartree
