program: Orca
programVersion: 5.0.2
elementType: N H C C H H O C C O N H H H C C O H O H N H H H C H H C C C C H C H C H H O H
charge: 1
multiplicity: 1
keywords: wB97X-D3BJ Opt Freq def2-TZVPP def2/J RIJCOSX VeryTightSCF
keywords: PAL8 defgrid3 VeryTightOpt
frequency: 0.00 0.00 0.00 0.00 0.00 0.00 18.97 24.48 30.52 38.09 48.77 55.92 68.42 72.12 94.36 144.69 172.72 182.94 220.19 240.39 283.62 291.28 304.11 312.92 339.67 365.15 378.28 380.27 416.25 429.07 434.61 486.98 498.28 509.53 519.39 564.75 574.29 590.98 617.35 642.13 659.23 690.80 716.04 720.54 749.73 782.47 823.11 851.00 858.01 873.02 874.91 885.53 900.70 925.20 958.36 981.85 1010.68 1041.89 1052.98 1054.01 1072.68 1081.49 1101.27 1129.09 1141.40 1156.68 1198.30 1201.63 1206.58 1240.38 1247.73 1279.72 1285.64 1292.26 1308.31 1332.36 1339.97 1348.71 1370.36 1373.42 1394.67 1396.78 1406.41 1432.90 1468.84 1475.38 1493.63 1500.83 1505.66 1567.98 1580.47 1600.71 1609.37 1672.93 1677.67 1701.31 1736.79 1813.31 1877.92 3090.41 3117.08 3121.31 3127.81 3144.80 3171.48 3177.29 3180.94 3183.84 3203.87 3231.04 3239.02 3462.45 3518.51 3658.33 3677.72 3802.96 3878.09
frequency: 18.97 24.48 30.52 38.09 48.77 55.92 68.42 72.12 94.36 144.69 172.72 182.94 220.19 240.39 283.62 291.28 304.11 312.92 339.67 365.15 378.28 380.27 416.25 429.07 434.61 486.98 498.28 509.53 519.39 564.75 574.29 590.98 617.35 642.13 659.23 690.80 716.04 720.54 749.73 782.47 823.11 851.00 858.01 873.02 874.91 885.53 900.70 925.20 958.36 981.85 1010.68 1041.89 1052.98 1054.01 1072.68 1081.49 1101.27 1129.09 1141.40 1156.68 1198.30 1201.63 1206.58 1240.38 1247.73 1279.72 1285.64 1292.26 1308.31 1332.36 1339.97 1348.71 1370.36 1373.42 1394.67 1396.78 1406.41 1432.90 1468.84 1475.38 1493.63 1500.83 1505.66 1567.98 1580.47 1600.71 1609.37 1672.93 1677.67 1701.31 1736.79 1813.31 1877.92 3090.41 3117.08 3121.31 3127.81 3144.80 3171.48 3177.29 3180.94 3183.84 3203.87 3231.04 3239.02 3462.45 3518.51 3658.33 3677.72 3802.96 3878.09
formula: C13H18N3O5
InChI: InChI=1S/C13H18N3O5/c14-10(5-8-1-3-9(17)4-2-8)13(21)16-6-11(18)15-7-12(19)20/h1-4,10,15-17,19H,5-7H2,14H3
39 atoms
N  -1.112134 2.059754 -2.772347
H  -1.731897 2.696405 -2.301394
C  -1.033734 2.086955 -4.218842
C  -1.746152 0.934027 -4.911363
H  -1.480546 3.014982 -4.576693
H  0.004318 2.064823 -4.545217
O  -1.471294 0.566962 -6.016662
C  -0.507892 1.094941 -2.073365
C  -0.720443 1.125111 -0.550062
O  0.181306 0.229445 -2.613724
N  -0.001466 0.023165 0.050496
H  -1.782572 1.041159 -0.319196
H  -0.353219 2.069611 -0.149887
H  -0.443747 -0.876738 -0.039435
C  1.349529 0.04336 -0.098919
C  2.037748 -1.30172 -0.352426
O  2.010409 1.056198 -0.187131
H  1.340218 -2.139744 -0.346751
O  -2.737243 0.410338 -4.166136
H  -3.160905 -0.275042 -4.700324
N  2.48307 -1.134654 -1.784119
H  2.947488 -1.979101 -2.121247
H  1.66745 -0.856963 -2.360255
H  3.146944 -0.357549 -1.818133
C  3.247896 -1.581324 0.534113
H  2.87839 -1.796592 1.538779
H  3.846882 -0.670406 0.598977
C  4.062879 -2.729542 -0.01195
C  5.237459 -2.493107 -0.728434
C  3.631764 -4.046921 0.130856
C  5.959253 -3.532626 -1.292241
H  5.614044 -1.478836 -0.825963
C  4.344195 -5.098808 -0.424849
H  2.734152 -4.264739 0.70163
C  5.512318 -4.843919 -1.142287
H  6.87796 -3.34985 -1.835135
H  4.000161 -6.11902 -0.291589
O  6.25576 -5.821209 -1.709968
H  5.885942 -6.686093 -1.51511
totalener: -1047.13980669 hartree
nucrepener: 1640.64241031 hartree
electener: -2687.78221700 hartree
oneelecener: -4665.62873447 hartree
twoeener: 1977.84651747 hartree
kineticenergy: 1041.99437930 hartree
exchangeener: -91.588750671441 hartree
correlationener: -6.610943662366 hartree
xcener: -98.199694333808 hartree
temp: 298.15 k
press: 1.00 atm
thermalcorrenthalpy: 0.00094421 hartree
totalenthalpy: -1046.87800054 hartree
totalentropycorr: -0.06469857 hartree
gibbsenthalpy: -1046.94269911 hartree
gibbsminuselec: 0.27729697 hartree
totalenthalpy: -1046.88046198 hartree
chargesum: 1.0000000
charge: -0.190677 0.191761 -0.064678 0.285175 0.130834 0.135014 -0.278391 0.363347 -0.122996 -0.486351 -0.150131 0.153309 0.154666 0.172858 0.157649 0.009708 -0.326371 0.136988 -0.278802 0.237051 -0.066644 0.240037 0.257620 0.231582 -0.183202 0.128984 0.141623 -0.002997 -0.206183 -0.178546 -0.130591 0.141851 -0.138216 0.131549 0.195558 0.145308 0.114991 -0.269933 0.217243
charge: 0.346724 -0.009008 -0.028187 -0.442999 0.041397 0.040959 0.137243 -0.359143 -0.030510 0.072312 0.325767 0.035736 0.041748 -0.019701 -0.389768 -0.046018 0.122150 0.033568 0.352888 -0.083028 0.617422 0.044676 0.010645 0.056976 0.002390 0.045471 0.042671 -0.115992 -0.017937 -0.006797 0.006634 0.024686 -0.010481 0.026021 -0.191103 0.031727 0.022655 0.370581 -0.102372
qa: -0.1907 0.1918 -0.0647 0.2852 0.1308 0.1350 -0.2784 0.3633 -0.1230 -0.4864 -0.1501 0.1533 0.1547 0.1729 0.1576 0.0097 -0.3264 0.1370 -0.2788 0.2371 -0.0666 0.2400 0.2576 0.2316 -0.1832 0.1290 0.1416 -0.0030 -0.2062 -0.1785 -0.1306 0.1419 -0.1382 0.1315 0.1956 0.1453 0.1150 -0.2699 0.2172
va: 3.2358 1.0065 3.8055 4.3081 1.0000 1.0231 2.2312 4.0578 3.8833 2.0122 3.2043 0.9938 1.0052 1.0167 4.3338 3.9318 2.1898 1.0100 2.1778 1.0191 3.6410 0.9763 1.0142 0.9953 3.8329 1.0118 1.0223 3.5109 3.9751 4.0403 4.0021 1.0030 3.9417 1.0050 4.0918 1.0077 1.0072 2.2303 1.0258
dispcorr: -0.081511486 hartree
energy: -1047.226320663760
dipole: 1.65835 -2.97427 -1.31591 -1.12234 0.90178 -0.22056 5.33488 -4.27298 1.06191
magnitude: 1.70526 au
magnitude: 4.33443 debye
zeropoint: 0.32434272 hartree
thermalvibcorrection: 0.01772868 hartree
thermalrotcorrection: 0.00141627 hartree
thermaltrasncorrection: 0.00141627 hartree
thermaltotal: -1046.88141672 hartree
thermalcorr: 0.02056122 hartree
nonthermalcorr: 0.32434272 hartree
totalcorr: 0.34490394 hartree
totalenthalpy: -1046.88047251 hartree
