program: Orca
programVersion: 5.0.2
elementType: N H C C H H O C C O N H H H C C O H O H N H H H C H H C C C C H C H C H H O H
charge: 1
multiplicity: 1
keywords: wB97X-D3BJ Opt Freq def2-TZVPP def2/J RIJCOSX VeryTightSCF
keywords: PAL8 defgrid3 VeryTightOpt
frequency: 0.00 0.00 0.00 0.00 0.00 0.00 10.49 25.40 28.71 35.15 49.02 57.06 69.33 104.75 122.94 133.69 164.34 167.88 214.07 268.94 282.54 293.79 303.42 321.79 336.72 352.35 369.70 379.48 415.63 426.97 432.11 505.63 512.67 525.97 543.92 547.81 580.25 587.19 603.33 618.93 660.14 668.44 673.08 727.39 736.63 782.16 800.66 844.13 853.99 868.58 871.61 881.77 951.06 952.52 980.08 982.30 1005.97 1016.94 1020.33 1042.75 1053.63 1112.88 1123.11 1141.83 1153.42 1174.92 1199.65 1200.64 1211.02 1249.39 1256.76 1268.21 1278.61 1285.60 1318.76 1324.48 1334.49 1360.88 1368.42 1371.52 1391.04 1398.10 1410.46 1420.66 1476.02 1495.24 1495.68 1504.81 1507.22 1578.89 1582.79 1598.38 1609.35 1674.54 1680.38 1703.35 1728.68 1790.12 1888.64 3052.04 3099.04 3104.39 3115.12 3143.10 3146.27 3168.19 3182.99 3189.00 3206.40 3210.98 3231.36 3463.15 3558.21 3630.38 3656.26 3800.83 3878.25
frequency: 10.49 25.40 28.71 35.15 49.02 57.06 69.33 104.75 122.94 133.69 164.34 167.88 214.07 268.94 282.54 293.79 303.42 321.79 336.72 352.35 369.70 379.48 415.63 426.97 432.11 505.63 512.67 525.97 543.92 547.81 580.25 587.19 603.33 618.93 660.14 668.44 673.08 727.39 736.63 782.16 800.66 844.13 853.99 868.58 871.61 881.77 951.06 952.52 980.08 982.30 1005.97 1016.94 1020.33 1042.75 1053.63 1112.88 1123.11 1141.83 1153.42 1174.92 1199.65 1200.64 1211.02 1249.39 1256.76 1268.21 1278.61 1285.60 1318.76 1324.48 1334.49 1360.88 1368.42 1371.52 1391.04 1398.10 1410.46 1420.66 1476.02 1495.24 1495.68 1504.81 1507.22 1578.89 1582.79 1598.38 1609.35 1674.54 1680.38 1703.35 1728.68 1790.12 1888.64 3052.04 3099.04 3104.39 3115.12 3143.10 3146.27 3168.19 3182.99 3189.00 3206.40 3210.98 3231.36 3463.15 3558.21 3630.38 3656.26 3800.83 3878.25
formula: C13H18N3O5
InChI: InChI=1S/C13H18N3O5/c14-10(5-8-1-3-9(17)4-2-8)13(21)16-6-11(18)15-7-12(19)20/h1-4,10,15-17,19H,5-7H2,14H3
39 atoms
N  -0.799439 1.935187 3.088058
H  -1.483719 2.578357 2.72339
C  -0.447982 2.044973 4.493047
C  -1.313544 3.031986 5.249509
H  -0.542821 1.076315 4.985462
H  0.589426 2.365367 4.611808
O  -1.19944 3.22879 6.422316
C  -0.237271 1.025736 2.292965
C  -0.705173 1.047388 0.823836
O  0.600452 0.216507 2.699835
N  -0.083672 -0.040689 0.107509
H  -0.428303 2.002658 0.377663
H  -1.789116 0.946284 0.772899
H  -0.539247 -0.939059 0.136376
C  1.265999 -0.025168 0.066666
C  2.035693 -1.344247 0.273256
O  1.932308 0.993012 0.040429
H  2.742509 -1.467736 -0.546494
O  -2.208541 3.660841 4.459598
H  -2.709903 4.275332 5.012832
N  2.841328 -0.973267 1.499555
H  3.428383 -1.734702 1.833042
H  3.405463 -0.150521 1.2733
H  2.160722 -0.67348 2.224619
C  1.263593 -2.625281 0.56351
H  0.709718 -2.49937 1.498129
H  1.988951 -3.429805 0.728404
C  0.303772 -3.006076 -0.54136
C  0.702639 -3.053772 -1.874549
C  -1.021023 -3.319383 -0.235736
C  -0.193612 -3.389978 -2.877074
H  1.72864 -2.836463 -2.152884
C  -1.927881 -3.658029 -1.225564
H  -1.350494 -3.311012 0.799167
C  -1.516189 -3.690654 -2.556016
H  0.135733 -3.422009 -3.910138
H  -2.954075 -3.906754 -0.986583
O  -2.442784 -4.021242 -3.484627
H  -2.053175 -4.034699 -4.362555
totalener: -1047.13251406 hartree
nucrepener: 1687.73419562 hartree
electener: -2734.86670968 hartree
oneelecener: -4759.86263589 hartree
twoeener: 2024.99592622 hartree
kineticenergy: 1041.98453945 hartree
exchangeener: -91.590659317173 hartree
correlationener: -6.614303246001 hartree
xcener: -98.204962563174 hartree
temp: 298.15 k
press: 1.00 atm
thermalcorrenthalpy: 0.00094421 hartree
totalenthalpy: -1046.87289897 hartree
totalentropycorr: -0.06413105 hartree
gibbsenthalpy: -1046.93703003 hartree
gibbsminuselec: 0.27761979 hartree
totalenthalpy: -1046.87486268 hartree
chargesum: 1.0000000
charge: -0.177994 0.188494 -0.063170 0.293832 0.133790 0.131896 -0.270953 0.340604 -0.112609 -0.488223 -0.148741 0.157482 0.146747 0.182721 0.145319 0.062378 -0.340560 0.165939 -0.292013 0.242570 -0.082816 0.223907 0.240932 0.254720 -0.192712 0.117697 0.121599 -0.038366 -0.168353 -0.167536 -0.128561 0.117074 -0.135735 0.144318 0.195866 0.113079 0.141688 -0.271474 0.217167
charge: 0.344075 -0.016949 -0.022615 -0.431670 0.041870 0.040649 0.147505 -0.358116 -0.030689 0.059323 0.342904 0.041049 0.035013 -0.025057 -0.383047 -0.037783 0.107742 0.039133 0.349111 -0.077082 0.612038 0.041936 0.049429 0.015737 -0.013060 0.036915 0.035237 -0.112053 -0.001290 -0.014566 -0.006213 0.023604 0.008498 0.025299 -0.188693 0.022906 0.031132 0.370231 -0.102451
qa: -0.1780 0.1885 -0.0632 0.2938 0.1338 0.1319 -0.2710 0.3406 -0.1126 -0.4882 -0.1487 0.1575 0.1467 0.1827 0.1453 0.0624 -0.3406 0.1659 -0.2920 0.2426 -0.0828 0.2239 0.2409 0.2547 -0.1927 0.1177 0.1216 -0.0384 -0.1684 -0.1675 -0.1286 0.1171 -0.1357 0.1443 0.1959 0.1131 0.1417 -0.2715 0.2172
va: 3.2180 1.0282 3.8418 4.3244 1.0091 1.0074 2.2387 4.0645 3.8769 2.0069 3.1829 1.0035 0.9969 1.0320 4.3682 3.7780 2.1716 0.9998 2.1574 1.0162 3.6359 0.9781 0.9918 1.0200 3.8941 1.0162 0.9947 3.6822 4.0365 3.9644 3.9404 1.0082 4.0238 0.9983 4.0887 1.0069 1.0089 2.2296 1.0257
dispcorr: -0.082353319 hartree
energy: -1047.220438585435
dipole: 5.33965 -3.53687 1.80278 -6.08681 5.43708 -0.64973 -2.72737 2.32105 -0.40633
magnitude: 1.95889 au
magnitude: 4.97911 debye
zeropoint: 0.32411733 hartree
thermalvibcorrection: 0.01768169 hartree
thermalrotcorrection: 0.00141627 hartree
thermaltrasncorrection: 0.00141627 hartree
thermaltotal: -1046.87580703 hartree
thermalcorr: 0.02051423 hartree
nonthermalcorr: 0.32411733 hartree
totalcorr: 0.34463155 hartree
totalenthalpy: -1046.87486282 hartree
