program: Orca
programVersion: 5.0.2
elementType: N H C C H H O C C O N H H H C C O H O H N H H H C H H C C C C H C H C H H O H
charge: 1
multiplicity: 1
keywords: wB97X-D3BJ Opt Freq def2-TZVPP def2/J RIJCOSX VeryTightSCF
keywords: PAL8 defgrid3 VeryTightOpt
frequency: 0.00 0.00 0.00 0.00 0.00 0.00 18.65 25.04 41.35 54.83 60.25 71.42 80.95 96.95 107.50 138.19 154.76 201.50 230.35 245.76 258.46 276.51 312.80 319.61 332.07 370.91 380.61 397.33 424.18 427.41 435.10 464.56 493.83 502.76 517.89 523.04 545.62 569.56 619.91 645.80 658.79 669.20 677.43 699.69 745.86 775.75 799.75 850.60 861.50 875.52 882.89 887.12 920.20 965.83 968.81 987.44 1012.98 1031.54 1042.71 1047.11 1059.09 1091.82 1119.85 1141.45 1162.15 1170.86 1197.80 1207.20 1208.69 1233.73 1248.11 1259.50 1269.63 1276.63 1308.90 1332.19 1335.48 1343.76 1360.65 1363.39 1369.21 1385.69 1418.89 1462.62 1471.77 1476.75 1496.10 1499.02 1503.09 1568.02 1581.30 1583.55 1604.95 1674.52 1682.67 1702.22 1777.54 1789.11 1833.81 3064.88 3084.77 3116.74 3120.68 3138.92 3144.89 3179.09 3179.54 3195.53 3202.97 3231.68 3274.49 3352.15 3559.27 3655.87 3695.76 3805.69 3877.90
frequency: 18.65 25.04 41.35 54.83 60.25 71.42 80.95 96.95 107.50 138.19 154.76 201.50 230.35 245.76 258.46 276.51 312.80 319.61 332.07 370.91 380.61 397.33 424.18 427.41 435.10 464.56 493.83 502.76 517.89 523.04 545.62 569.56 619.91 645.80 658.79 669.20 677.43 699.69 745.86 775.75 799.75 850.60 861.50 875.52 882.89 887.12 920.20 965.83 968.81 987.44 1012.98 1031.54 1042.71 1047.11 1059.09 1091.82 1119.85 1141.45 1162.15 1170.86 1197.80 1207.20 1208.69 1233.73 1248.11 1259.50 1269.63 1276.63 1308.90 1332.19 1335.48 1343.76 1360.65 1363.39 1369.21 1385.69 1418.89 1462.62 1471.77 1476.75 1496.10 1499.02 1503.09 1568.02 1581.30 1583.55 1604.95 1674.52 1682.67 1702.22 1777.54 1789.11 1833.81 3064.88 3084.77 3116.74 3120.68 3138.92 3144.89 3179.09 3179.54 3195.53 3202.97 3231.68 3274.49 3352.15 3559.27 3655.87 3695.76 3805.69 3877.90
formula: C13H18N3O5
InChI: InChI=1S/C13H18N3O5/c14-10(5-8-1-3-9(17)4-2-8)13(21)16-6-11(18)15-7-12(19)20/h1-4,10,15-17,19H,5-7H2,14H3
39 atoms
N  -0.042281 1.149599 -2.552073
H  -0.05771 0.160895 -2.379752
C  0.671658 1.602066 -3.711016
C  1.989289 0.875654 -3.872459
H  0.104332 1.470469 -4.636934
H  0.86558 2.671607 -3.605146
O  2.385429 -0.02329 -3.152424
C  -0.290204 1.988998 -1.49886
C  -0.700108 1.283912 -0.199189
O  -0.214239 3.191006 -1.568945
N  -0.019458 0.004086 -0.054603
H  -1.775665 1.108805 -0.200642
H  -0.452591 1.961971 0.615877
H  -0.535875 -0.844377 0.111762
C  1.320507 -0.014679 -0.012144
C  2.020797 -1.378413 -0.096173
O  2.015973 0.988346 0.021817
H  1.490147 -2.050432 -0.769805
O  2.664372 1.31205 -4.923334
H  3.48626 0.811288 -5.014002
N  3.333917 -1.036216 -0.734262
H  3.627025 -0.147022 -0.302765
H  4.035669 -1.761579 -0.609808
H  3.189469 -0.820008 -1.734657
C  2.220311 -2.028725 1.275527
H  2.805081 -1.356338 1.908763
H  2.790881 -2.954047 1.150603
C  0.879933 -2.309617 1.911164
C  0.377768 -1.479206 2.912243
C  0.08614 -3.359107 1.457245
C  -0.881815 -1.684148 3.446403
H  0.980799 -0.656735 3.282783
C  -1.181643 -3.575878 1.97988
H  0.460008 -4.034666 0.693301
C  -1.669446 -2.73619 2.979813
H  -1.269496 -1.047179 4.231319
H  -1.782712 -4.406037 1.624253
O  -2.892202 -2.889271 3.538467
H  -3.332022 -3.667369 3.186495
totalener: -1047.13950962 hartree
nucrepener: 1755.06997289 hartree
electener: -2802.20948251 hartree
oneelecener: -4894.05546880 hartree
twoeener: 2091.84598629 hartree
kineticenergy: 1042.00138867 hartree
exchangeener: -91.594322908579 hartree
correlationener: -6.615457190587 hartree
xcener: -98.209780099167 hartree
temp: 298.15 k
press: 1.00 atm
thermalcorrenthalpy: 0.00094421 hartree
totalenthalpy: -1046.88201197 hartree
totalentropycorr: -0.06378508 hartree
gibbsenthalpy: -1046.94579705 hartree
gibbsminuselec: 0.27765197 hartree
totalenthalpy: -1046.88388157 hartree
chargesum: 1.0000000
charge: -0.180786 0.144697 -0.069785 0.372979 0.148815 0.145145 -0.439097 0.242778 -0.077726 -0.315965 -0.194896 0.134428 0.145724 0.206477 0.160611 0.017623 -0.352992 0.153993 -0.220669 0.237171 -0.072439 0.231205 0.223529 0.249797 -0.147480 0.130582 0.125355 -0.050950 -0.118056 -0.207061 -0.144658 0.133864 -0.141832 0.126631 0.193663 0.145384 0.116016 -0.268960 0.216885
charge: 0.318101 -0.043824 -0.036568 -0.395546 0.040912 0.051212 0.078659 -0.387399 -0.015540 0.122009 0.344731 0.035331 0.040709 -0.014169 -0.393964 -0.048619 0.118992 0.036362 0.411001 -0.075564 0.611737 0.037460 0.040362 0.001147 -0.002591 0.041397 0.034339 -0.111879 0.002936 -0.014731 0.008464 0.029392 -0.018432 0.024666 -0.193078 0.032406 0.021817 0.370484 -0.102727
qa: -0.1808 0.1447 -0.0698 0.3730 0.1488 0.1451 -0.4391 0.2428 -0.0777 -0.3160 -0.1949 0.1344 0.1457 0.2065 0.1606 0.0176 -0.3530 0.1540 -0.2207 0.2372 -0.0724 0.2312 0.2235 0.2498 -0.1475 0.1306 0.1254 -0.0510 -0.1181 -0.2071 -0.1447 0.1339 -0.1418 0.1266 0.1937 0.1454 0.1160 -0.2690 0.2169
va: 3.1105 1.0500 3.8298 4.2091 1.0010 1.0372 2.0294 4.2553 3.7740 2.2221 3.1546 0.9954 1.0217 0.9936 4.3208 3.8197 2.1668 1.0074 2.2874 1.0202 3.6186 1.0157 0.9780 1.0300 3.8383 1.0101 1.0050 3.6354 3.9930 4.0038 3.9887 1.0033 3.9326 1.0084 4.0762 1.0081 1.0073 2.2303 1.0259
dispcorr: -0.084107199 hartree
energy: -1047.229147322882
dipole: 3.36752 -1.21016 2.15735 -7.29992 4.36233 -2.93759 1.47186 -2.82882 -1.35696
magnitude: 3.88908 au
magnitude: 9.88526 debye
zeropoint: 0.32386134 hartree
thermalvibcorrection: 0.01762496 hartree
thermalrotcorrection: 0.00141627 hartree
thermaltrasncorrection: 0.00141627 hartree
thermaltotal: -1046.88482848 hartree
thermalcorr: 0.02045750 hartree
nonthermalcorr: 0.32386134 hartree
totalcorr: 0.34431884 hartree
totalenthalpy: -1046.88388427 hartree
